1 (29.11.2014 13:21:01 отредактировано XliN)

Тема: Не могу установить logwatch

Ловлю вот такую ошибку

+ открыть спойлер

Консоль
make[3]: Leaving directory `/var/tmp/portage/dev-libs/libtasn1-3.6/work/libtasn1-3.6-abi_x86_64.amd64/examples'
make[2]: Leaving directory `/var/tmp/portage/dev-libs/libtasn1-3.6/work/libtasn1-3.6-abi_x86_64.amd64/examples'
Making all in tests
make[2]: Entering directory `/var/tmp/portage/dev-libs/libtasn1-3.6/work/libtasn1-3.6-abi_x86_64.amd64/tests'
make[2]: Nothing to be done for `all'.
make[2]: Leaving directory `/var/tmp/portage/dev-libs/libtasn1-3.6/work/libtasn1-3.6-abi_x86_64.amd64/tests'
Making all in doc
make[2]: Entering directory `/var/tmp/portage/dev-libs/libtasn1-3.6/work/libtasn1-3.6-abi_x86_64.amd64/doc'
Making all in cyclo
make[3]: Entering directory `/var/tmp/portage/dev-libs/libtasn1-3.6/work/libtasn1-3.6-abi_x86_64.amd64/doc/cyclo'
make[3]: Nothing to be done for `all'.
make[3]: Leaving directory `/var/tmp/portage/dev-libs/libtasn1-3.6/work/libtasn1-3.6-abi_x86_64.amd64/doc/cyclo'
make[3]: Entering directory `/var/tmp/portage/dev-libs/libtasn1-3.6/work/libtasn1-3.6-abi_x86_64.amd64/doc'
/bin/sh /var/tmp/portage/dev-libs/libtasn1-3.6/work/libtasn1-3.6/build-aux/missing help2man --info-page libtasn1 \
    --name="ASN.1 syntax tree generator for libtasn1" \
    --output=asn1Parser.1 ../src/asn1Parser
/bin/sh /var/tmp/portage/dev-libs/libtasn1-3.6/work/libtasn1-3.6/build-aux/missing help2man --info-page libtasn1 \
    --name="ASN.1 DER encoder" \
    --output=asn1Coding.1 ../src/asn1Coding
/bin/sh /var/tmp/portage/dev-libs/libtasn1-3.6/work/libtasn1-3.6/build-aux/missing help2man --info-page libtasn1 \
    --name="ASN.1 DER decoder" \
    --output=asn1Decoding.1 ../src/asn1Decoding
Can't locate Locale/gettext.pm in @INC (@INC contains: /etc/perl /usr/local/lib64/perl5/5.16.3/x86_64-linux /usr/local/lib64/perl5/5.16.3 /usr/lib64/perl5/vendor_perl/5.16.3/x86_64-linux /usr/lib64/perl5/vendor_perl/5.16.3 /usr/local/lib64/perl5 /usr/lib64/perl5/vendor_perl /usr/lib64/perl5/5.16.3/x86_64-linux /usr/lib64/perl5/5.16.3 .) at /usr/bin/help2man line 28.
BEGIN failed--compilation aborted at /usr/bin/help2man line 28.
Can't locate Locale/gettext.pm in @INC (@INC contains: /etc/perl /usr/local/lib64/perl5/5.16.3/x86_64-linux /usr/local/lib64/perl5/5.16.3 /usr/lib64/perl5/vendor_perl/5.16.3/x86_64-linux /usr/lib64/perl5/vendor_perl/5.16.3 /usr/local/lib64/perl5 /usr/lib64/perl5/vendor_perl /usr/lib64/perl5/5.16.3/x86_64-linux /usr/lib64/perl5/5.16.3 .) at /usr/bin/help2man line 28.
BEGIN failed--compilation aborted at /usr/bin/help2man line 28.
make[3]: *** [asn1Parser.1] Error 2
make[3]: *** Waiting for unfinished jobs....
make[3]: *** [asn1Coding.1] Error 2
Can't locate Locale/gettext.pm in @INC (@INC contains: /etc/perl /usr/local/lib64/perl5/5.16.3/x86_64-linux /usr/local/lib64/perl5/5.16.3 /usr/lib64/perl5/vendor_perl/5.16.3/x86_64-linux /usr/lib64/perl5/vendor_perl/5.16.3 /usr/local/lib64/perl5 /usr/lib64/perl5/vendor_perl /usr/lib64/perl5/5.16.3/x86_64-linux /usr/lib64/perl5/5.16.3 .) at /usr/bin/help2man line 28.
BEGIN failed--compilation aborted at /usr/bin/help2man line 28.
make[3]: *** [asn1Decoding.1] Error 2
make[3]: Leaving directory `/var/tmp/portage/dev-libs/libtasn1-3.6/work/libtasn1-3.6-abi_x86_64.amd64/doc'
make[2]: *** [all-recursive] Error 1
make[2]: Leaving directory `/var/tmp/portage/dev-libs/libtasn1-3.6/work/libtasn1-3.6-abi_x86_64.amd64/doc'
make[1]: *** [all-recursive] Error 1
make[1]: Leaving directory `/var/tmp/portage/dev-libs/libtasn1-3.6/work/libtasn1-3.6-abi_x86_64.amd64'
make: *** [all] Ошибка 2
* ERROR: dev-libs/libtasn1-3.6::gentoo failed (compile phase):
*   emake failed
*
* If you need support, post the output of `emerge --info '=dev-libs/libtasn1-3.6::gentoo'`,
* the complete build log and the output of `emerge -pqv '=dev-libs/libtasn1-3.6::gentoo'`.
* The complete build log is located at '/var/tmp/portage/dev-libs/libtasn1-3.6/temp/build.log'.
* The ebuild environment file is located at '/var/tmp/portage/dev-libs/libtasn1-3.6/temp/environment'.
* Working directory: '/var/tmp/portage/dev-libs/libtasn1-3.6/work/libtasn1-3.6-abi_x86_64.amd64'
* S: '/var/tmp/portage/dev-libs/libtasn1-3.6/work/libtasn1-3.6'

>>> Failed to emerge dev-libs/libtasn1-3.6, Log file:

>>>  '/var/tmp/portage/dev-libs/libtasn1-3.6/temp/build.log'

* Messages for package dev-libs/libtasn1-3.6:

* ERROR: dev-libs/libtasn1-3.6::gentoo failed (compile phase):
*   emake failed
*
* If you need support, post the output of `emerge --info '=dev-libs/libtasn1-3.6::gentoo'`,
* the complete build log and the output of `emerge -pqv '=dev-libs/libtasn1-3.6::gentoo'`.
* The complete build log is located at '/var/tmp/portage/dev-libs/libtasn1-3.6/temp/build.log'.
* The ebuild environment file is located at '/var/tmp/portage/dev-libs/libtasn1-3.6/temp/environment'.
* Working directory: '/var/tmp/portage/dev-libs/libtasn1-3.6/work/libtasn1-3.6-abi_x86_64.amd64'
* S: '/var/tmp/portage/dev-libs/libtasn1-3.6/work/libtasn1-3.6'

* GNU info directory index is up-to-date.

* IMPORTANT: 15 config files in '/etc' need updating.
* See the CONFIGURATION FILES section of the emerge
* man page to learn how to update config files.

* IMPORTANT: 5 news items need reading for repository 'gentoo'.
* Use eselect news to read news items.

Полный лог https://bpaste.net/show/2056cfb170ec

2

Re: Не могу установить logwatch

Решил проблему обновлением dev-perl/Locale-gettext