<?xml version="1.0" encoding="utf-8"?>
<rss version="2.0" xmlns:atom="http://www.w3.org/2005/Atom">
	<channel>
		<title><![CDATA[Linux Forum &mdash; Сказ о том как EvgeniusDragon на Debian переходил]]></title>
		<link>https://linuxforum.ru/viewtopic.php?id=18133</link>
		<atom:link href="https://linuxforum.ru/extern.php?action=feed&amp;tid=18133&amp;type=rss" rel="self" type="application/rss+xml" />
		<description><![CDATA[Недавние сообщения в теме «Сказ о том как EvgeniusDragon на Debian переходил».]]></description>
		<lastBuildDate>Sat, 19 Nov 2011 14:23:24 +0000</lastBuildDate>
		<generator>PunBB</generator>
		<item>
			<title><![CDATA[Re: Сказ о том как EvgeniusDragon на Debian переходил]]></title>
			<link>https://linuxforum.ru/viewtopic.php?pid=226826#p226826</link>
			<description><![CDATA[<p><strong>Writer</strong>, <br /></p><div class="quotebox"><blockquote><p>Всё дело в руках.</p></blockquote></div><p>+1</p>]]></description>
			<author><![CDATA[null@example.com (Rassol2)]]></author>
			<pubDate>Sat, 19 Nov 2011 14:23:24 +0000</pubDate>
			<guid>https://linuxforum.ru/viewtopic.php?pid=226826#p226826</guid>
		</item>
		<item>
			<title><![CDATA[Re: Сказ о том как EvgeniusDragon на Debian переходил]]></title>
			<link>https://linuxforum.ru/viewtopic.php?pid=226735#p226735</link>
			<description><![CDATA[<p><strong>ABulychev</strong>, дык у меня версия libcairo2 1.10.2-6, та же что и в тестинг :-). Но забить тоже хороший вариант :-)</p>]]></description>
			<author><![CDATA[null@example.com (papin-aziat)]]></author>
			<pubDate>Sat, 19 Nov 2011 09:55:24 +0000</pubDate>
			<guid>https://linuxforum.ru/viewtopic.php?pid=226735#p226735</guid>
		</item>
		<item>
			<title><![CDATA[Re: Сказ о том как EvgeniusDragon на Debian переходил]]></title>
			<link>https://linuxforum.ru/viewtopic.php?pid=226734#p226734</link>
			<description><![CDATA[<p>Это самое главное ))</p>]]></description>
			<author><![CDATA[null@example.com (Otten)]]></author>
			<pubDate>Sat, 19 Nov 2011 09:53:25 +0000</pubDate>
			<guid>https://linuxforum.ru/viewtopic.php?pid=226734#p226734</guid>
		</item>
		<item>
			<title><![CDATA[Re: Сказ о том как EvgeniusDragon на Debian переходил]]></title>
			<link>https://linuxforum.ru/viewtopic.php?pid=226731#p226731</link>
			<description><![CDATA[<p><strong>Otten</strong>, меня устраивает ))</p>]]></description>
			<author><![CDATA[null@example.com (SidER)]]></author>
			<pubDate>Sat, 19 Nov 2011 09:33:11 +0000</pubDate>
			<guid>https://linuxforum.ru/viewtopic.php?pid=226731#p226731</guid>
		</item>
		<item>
			<title><![CDATA[Re: Сказ о том как EvgeniusDragon на Debian переходил]]></title>
			<link>https://linuxforum.ru/viewtopic.php?pid=226727#p226727</link>
			<description><![CDATA[<p>Что-то не очень там оно на скрине..</p>]]></description>
			<author><![CDATA[null@example.com (Otten)]]></author>
			<pubDate>Sat, 19 Nov 2011 09:23:19 +0000</pubDate>
			<guid>https://linuxforum.ru/viewtopic.php?pid=226727#p226727</guid>
		</item>
		<item>
			<title><![CDATA[Re: Сказ о том как EvgeniusDragon на Debian переходил]]></title>
			<link>https://linuxforum.ru/viewtopic.php?pid=226724#p226724</link>
			<description><![CDATA[<div class="quotebox"><cite>papin-aziat пишет:</cite><blockquote><p>гм... вот это номер да, как видно дебиановский патч дает ошибку. А cairo установленный и сорцы из сида или из testing? Как вариант предлагаю откатить до тестинг cairo и собирать соответственно из него. Хотя сид обычно работает очень хорошо и скорее всего проблемы в другом.</p></blockquote></div><p>В wheezy и sid одни и те же версии, так что разницы наверное не будет видно. <br /><strong>papin-aziat</strong>, забейте. Для моего случая нашел следующий выход: установка пакетов с патчами от <a href="http://www.debianforum.ru/index.php?topic=1290.msg14451#msg14451">infinality</a>. wink</p>]]></description>
			<author><![CDATA[null@example.com (SidER)]]></author>
			<pubDate>Sat, 19 Nov 2011 09:19:18 +0000</pubDate>
			<guid>https://linuxforum.ru/viewtopic.php?pid=226724#p226724</guid>
		</item>
		<item>
			<title><![CDATA[Re: Сказ о том как EvgeniusDragon на Debian переходил]]></title>
			<link>https://linuxforum.ru/viewtopic.php?pid=226714#p226714</link>
			<description><![CDATA[<p><strong>Otten</strong>, это дебиановский патч :-)</p>]]></description>
			<author><![CDATA[null@example.com (papin-aziat)]]></author>
			<pubDate>Sat, 19 Nov 2011 09:02:57 +0000</pubDate>
			<guid>https://linuxforum.ru/viewtopic.php?pid=226714#p226714</guid>
		</item>
		<item>
			<title><![CDATA[Re: Сказ о том как EvgeniusDragon на Debian переходил]]></title>
			<link>https://linuxforum.ru/viewtopic.php?pid=226711#p226711</link>
			<description><![CDATA[<p><strong>ABulychev</strong>,&nbsp; ltmain_as-needed.patch&nbsp; Это же не тот патч, что рекомендовал <strong>papin-aziat</strong> ?</p><div class="codebox"><pre><code>patch -Np1 &lt; debian/ltmain_as-needed.patch
patching file build/ltmain.sh
Hunk #1 succeeded at 5800 (offset 1084 lines).
Hunk #2 FAILED at 5075.</code></pre></div><p>Тут ошибку же показывает?</p>]]></description>
			<author><![CDATA[null@example.com (Otten)]]></author>
			<pubDate>Sat, 19 Nov 2011 08:49:54 +0000</pubDate>
			<guid>https://linuxforum.ru/viewtopic.php?pid=226711#p226711</guid>
		</item>
		<item>
			<title><![CDATA[Re: Сказ о том как EvgeniusDragon на Debian переходил]]></title>
			<link>https://linuxforum.ru/viewtopic.php?pid=226708#p226708</link>
			<description><![CDATA[<p>гм... вот это номер да, как видно дебиановский патч дает ошибку. А cairo установленный и сорцы из сида или из testing? Как вариант предлагаю откатить до тестинг cairo и собирать соответственно из него. Хотя сид обычно работает очень хорошо и скорее всего проблемы в другом.</p>]]></description>
			<author><![CDATA[null@example.com (papin-aziat)]]></author>
			<pubDate>Sat, 19 Nov 2011 08:31:03 +0000</pubDate>
			<guid>https://linuxforum.ru/viewtopic.php?pid=226708#p226708</guid>
		</item>
		<item>
			<title><![CDATA[Re: Сказ о том как EvgeniusDragon на Debian переходил]]></title>
			<link>https://linuxforum.ru/viewtopic.php?pid=226676#p226676</link>
			<description><![CDATA[<p><strong>papin-aziat</strong>, похоже и без патча собираться не хочет. Вывод dpkg-buildpackage -rfakeroot:<br /><div class="termtitle" style="font-family: sans-serif; position:relative; height:auto; width:auto; background:#3A4061; color:#FFFFFF; padding: 1px;"><b> Консоль:</b></div>
<div class="termcont" style="font-family: Terminus; position:relative; height:auto; width:auto; overflow-x:scroll; white-space: nowrap ; overflow-y:auto;background:#000000; color:#4EF44E; line-height:1.2; padding: 3px; font-size: 1rem; max-height: 60vh"><br />configure.ac:646: the top level<br />test/Makefile.am:1735: `%&#039;-style pattern rules are a GNU make extension<br />test/Makefile.am:1736: &lt;: non-POSIX variable name<br />build/Makefile.am.changelog:57: `%&#039;-style pattern rules are a GNU make extension<br />Makefile.am:80:&nbsp; &nbsp;`build/Makefile.am.changelog&#039; included from here<br />patch -Np1 &lt; debian/ltmain_as-needed.patch<br />patching file build/ltmain.sh<br />Hunk #1 succeeded at 5800 (offset 1084 lines).<br />Hunk #2 FAILED at 5075.<br />1 out of 2 hunks FAILED -- saving rejects to file build/ltmain.sh.rej<br />make: *** [configure-common-stamp] Ошибка 1<br />dpkg-buildpackage: ошибка: debian/rules build возвратил код ошибки 2</div><br />Полностью вывод:<br /></p><div class="fancy_spoiler_switcher"><div class="fancy_spoiler_switcher_header" data-lang-open="открыть спойлер" data-lang-close="скрыть спойлер"><strong>+</strong>&nbsp;открыть спойлер</div><div class="fancy_spoiler"><p>dpkg-buildpackage: пакет исходных текстов cairo<br />dpkg-buildpackage: версия исходных текстов 1.10.2-6.1<br />dpkg-buildpackage: исходные тексты изменены Aurelien Jarno &lt;aurel32@debian.org&gt;<br />dpkg-buildpackage: архитектура узла i386<br /> dpkg-source --before-build cairo-1.10.2<br /> fakeroot debian/rules clean<br />dh_testdir<br />dh_testroot<br />[ ! -r src/cairo-features.h.orig ] || mv -f src/cairo-features.h.orig src/cairo-features.h<br />[ ! -r configure-common-stamp ] || patch -NRp1 &lt; debian/ltmain_as-needed.patch<br />rm -f *-stamp<br />rm -rf /home/abulychev/constructor/cairo-1.10.2/debian/build /home/abulychev/constructor/cairo-1.10.2/debian/install<br />dh_autoreconf_clean<br />dh_clean<br /> dpkg-source -b cairo-1.10.2<br />dpkg-source: инфо: используется формат исходника «3.0 (quilt)»<br />dpkg-source: инфо: сборка cairo с использованием существующего ./cairo_1.10.2.orig.tar.gz<br />dpkg-source: инфо: сборка cairo в cairo_1.10.2-6.1.debian.tar.gz<br />dpkg-source: инфо: сборка cairo в cairo_1.10.2-6.1.dsc<br /> debian/rules build<br />dh_testdir<br /># Generated by configure and breaks the build if already existing<br />test -r src/cairo-features.h &amp;&amp; \<br />&nbsp; &nbsp;&nbsp; &nbsp;mv src/cairo-features.h src/cairo-features.h.orig<br />make: [configure-common-stamp] Ошибка 1 (игнорирована)<br />dh_autoreconf<br />configure.ac:16: warning: AC_LANG_CONFTEST: no AC_LANG_SOURCE call detected in body<br />../../lib/autoconf/lang.m4:194: AC_LANG_CONFTEST is expanded from...<br />../../lib/autoconf/general.m4:2662: _AC_LINK_IFELSE is expanded from...<br />../../lib/autoconf/general.m4:2679: AC_LINK_IFELSE is expanded from...<br />build/libtool.m4:1022: _LT_SYS_MODULE_PATH_AIX is expanded from...<br />build/libtool.m4:4170: _LT_LINKER_SHLIBS is expanded from...<br />build/libtool.m4:5253: _LT_LANG_C_CONFIG is expanded from...<br />build/libtool.m4:138: _LT_SETUP is expanded from...<br />build/libtool.m4:67: LT_INIT is expanded from...<br />build/libtool.m4:102: AC_PROG_LIBTOOL is expanded from...<br />configure.ac:16: the top level<br />configure.ac:16: warning: AC_LANG_CONFTEST: no AC_LANG_SOURCE call detected in body<br />../../lib/autoconf/lang.m4:194: AC_LANG_CONFTEST is expanded from...<br />../../lib/autoconf/general.m4:2662: _AC_LINK_IFELSE is expanded from...<br />../../lib/autoconf/general.m4:2679: AC_LINK_IFELSE is expanded from...<br />build/libtool.m4:4170: _LT_LINKER_SHLIBS is expanded from...<br />build/libtool.m4:5253: _LT_LANG_C_CONFIG is expanded from...<br />build/libtool.m4:138: _LT_SETUP is expanded from...<br />build/libtool.m4:67: LT_INIT is expanded from...<br />build/libtool.m4:102: AC_PROG_LIBTOOL is expanded from...<br />configure.ac:16: the top level<br />build/configure.ac.tools:7: warning: AC_LANG_CONFTEST: no AC_LANG_SOURCE call detected in body<br />../../lib/autoconf/lang.m4:194: AC_LANG_CONFTEST is expanded from...<br />../../lib/autoconf/general.m4:2662: _AC_LINK_IFELSE is expanded from...<br />../../lib/autoconf/general.m4:2679: AC_LINK_IFELSE is expanded from...<br />build/libtool.m4:1022: _LT_SYS_MODULE_PATH_AIX is expanded from...<br />build/libtool.m4:5360: _LT_LANG_CXX_CONFIG is expanded from...<br />build/libtool.m4:785: _LT_LANG is expanded from...<br />build/libtool.m4:768: LT_LANG is expanded from...<br />build/configure.ac.tools:7: the top level<br />build/configure.ac.warnings:39: warning: AC_LANG_CONFTEST: no AC_LANG_SOURCE call detected in body<br />../../lib/autoconf/lang.m4:194: AC_LANG_CONFTEST is expanded from...<br />../../lib/autoconf/general.m4:2662: _AC_LINK_IFELSE is expanded from...<br />../../lib/autoconf/general.m4:2679: AC_LINK_IFELSE is expanded from...<br />build/aclocal.cairo.m4:89: CAIRO_CC_TRY_LINK_WITH_ENV_SILENT is expanded from...<br />build/aclocal.cairo.m4:124: CAIRO_CC_TRY_FLAG_SILENT is expanded from...<br />build/aclocal.cairo.m4:131: CAIRO_CC_CHECK_WERROR is expanded from...<br />build/aclocal.cairo.m4:148: CAIRO_CC_TRY_FLAG is expanded from...<br />../../lib/m4sugar/m4sh.m4:606: AS_IF is expanded from...<br />../../lib/autoconf/general.m4:2032: AC_CACHE_VAL is expanded from...<br />../../lib/autoconf/general.m4:2053: AC_CACHE_CHECK is expanded from...<br />build/configure.ac.warnings:39: the top level<br />build/configure.ac.warnings:39: warning: AC_LANG_CONFTEST: no AC_LANG_SOURCE call detected in body<br />../../lib/autoconf/lang.m4:194: AC_LANG_CONFTEST is expanded from...<br />../../lib/autoconf/general.m4:2662: _AC_LINK_IFELSE is expanded from...<br />../../lib/autoconf/general.m4:2679: AC_LINK_IFELSE is expanded from...<br />build/aclocal.cairo.m4:89: CAIRO_CC_TRY_LINK_WITH_ENV_SILENT is expanded from...<br />build/aclocal.cairo.m4:124: CAIRO_CC_TRY_FLAG_SILENT is expanded from...<br />build/aclocal.cairo.m4:148: CAIRO_CC_TRY_FLAG is expanded from...<br />../../lib/m4sugar/m4sh.m4:606: AS_IF is expanded from...<br />../../lib/autoconf/general.m4:2032: AC_CACHE_VAL is expanded from...<br />../../lib/autoconf/general.m4:2053: AC_CACHE_CHECK is expanded from...<br />build/configure.ac.warnings:39: the top level<br />build/configure.ac.warnings:69: warning: AC_LANG_CONFTEST: no AC_LANG_SOURCE call detected in body<br />../../lib/autoconf/lang.m4:194: AC_LANG_CONFTEST is expanded from...<br />../../lib/autoconf/general.m4:2662: _AC_LINK_IFELSE is expanded from...<br />../../lib/autoconf/general.m4:2679: AC_LINK_IFELSE is expanded from...<br />build/aclocal.cairo.m4:89: CAIRO_CC_TRY_LINK_WITH_ENV_SILENT is expanded from...<br />build/aclocal.cairo.m4:124: CAIRO_CC_TRY_FLAG_SILENT is expanded from...<br />../../lib/m4sugar/m4sh.m4:606: AS_IF is expanded from...<br />../../lib/autoconf/general.m4:2032: AC_CACHE_VAL is expanded from...<br />../../lib/autoconf/general.m4:2053: AC_CACHE_CHECK is expanded from...<br />build/configure.ac.warnings:69: the top level<br />build/configure.ac.warnings:83: warning: AC_LANG_CONFTEST: no AC_LANG_SOURCE call detected in body<br />../../lib/autoconf/lang.m4:194: AC_LANG_CONFTEST is expanded from...<br />../../lib/autoconf/general.m4:2662: _AC_LINK_IFELSE is expanded from...<br />../../lib/autoconf/general.m4:2679: AC_LINK_IFELSE is expanded from...<br />build/aclocal.cairo.m4:89: CAIRO_CC_TRY_LINK_WITH_ENV_SILENT is expanded from...<br />build/aclocal.cairo.m4:124: CAIRO_CC_TRY_FLAG_SILENT is expanded from...<br />build/aclocal.cairo.m4:131: CAIRO_CC_CHECK_WERROR is expanded from...<br />build/aclocal.cairo.m4:148: CAIRO_CC_TRY_FLAG is expanded from...<br />../../lib/m4sugar/m4sh.m4:606: AS_IF is expanded from...<br />../../lib/autoconf/general.m4:2032: AC_CACHE_VAL is expanded from...<br />../../lib/autoconf/general.m4:2053: AC_CACHE_CHECK is expanded from...<br />build/configure.ac.warnings:83: the top level<br />build/configure.ac.warnings:83: warning: AC_LANG_CONFTEST: no AC_LANG_SOURCE call detected in body<br />../../lib/autoconf/lang.m4:194: AC_LANG_CONFTEST is expanded from...<br />../../lib/autoconf/general.m4:2662: _AC_LINK_IFELSE is expanded from...<br />../../lib/autoconf/general.m4:2679: AC_LINK_IFELSE is expanded from...<br />build/aclocal.cairo.m4:89: CAIRO_CC_TRY_LINK_WITH_ENV_SILENT is expanded from...<br />build/aclocal.cairo.m4:124: CAIRO_CC_TRY_FLAG_SILENT is expanded from...<br />build/aclocal.cairo.m4:148: CAIRO_CC_TRY_FLAG is expanded from...<br />../../lib/m4sugar/m4sh.m4:606: AS_IF is expanded from...<br />../../lib/autoconf/general.m4:2032: AC_CACHE_VAL is expanded from...<br />../../lib/autoconf/general.m4:2053: AC_CACHE_CHECK is expanded from...<br />build/configure.ac.warnings:83: the top level<br />build/configure.ac.analysis:75: warning: AC_LANG_CONFTEST: no AC_LANG_SOURCE call detected in body<br />../../lib/autoconf/lang.m4:194: AC_LANG_CONFTEST is expanded from...<br />../../lib/autoconf/general.m4:2662: _AC_LINK_IFELSE is expanded from...<br />../../lib/autoconf/general.m4:2679: AC_LINK_IFELSE is expanded from...<br />build/aclocal.cairo.m4:89: CAIRO_CC_TRY_LINK_WITH_ENV_SILENT is expanded from...<br />build/aclocal.cairo.m4:124: CAIRO_CC_TRY_FLAG_SILENT is expanded from...<br />build/aclocal.cairo.m4:131: CAIRO_CC_CHECK_WERROR is expanded from...<br />build/aclocal.cairo.m4:148: CAIRO_CC_TRY_FLAG is expanded from...<br />build/configure.ac.analysis:75: the top level<br />build/configure.ac.analysis:75: warning: AC_LANG_CONFTEST: no AC_LANG_SOURCE call detected in body<br />../../lib/autoconf/lang.m4:194: AC_LANG_CONFTEST is expanded from...<br />../../lib/autoconf/general.m4:2662: _AC_LINK_IFELSE is expanded from...<br />../../lib/autoconf/general.m4:2679: AC_LINK_IFELSE is expanded from...<br />build/aclocal.cairo.m4:89: CAIRO_CC_TRY_LINK_WITH_ENV_SILENT is expanded from...<br />build/aclocal.cairo.m4:124: CAIRO_CC_TRY_FLAG_SILENT is expanded from...<br />build/aclocal.cairo.m4:148: CAIRO_CC_TRY_FLAG is expanded from...<br />build/configure.ac.analysis:75: the top level<br />configure.ac:646: warning: AC_LANG_CONFTEST: no AC_LANG_SOURCE call detected in body<br />../../lib/autoconf/lang.m4:194: AC_LANG_CONFTEST is expanded from...<br />../../lib/autoconf/general.m4:2662: _AC_LINK_IFELSE is expanded from...<br />../../lib/autoconf/general.m4:2679: AC_LINK_IFELSE is expanded from...<br />build/aclocal.cairo.m4:89: CAIRO_CC_TRY_LINK_WITH_ENV_SILENT is expanded from...<br />build/configure.ac.pthread:136: CAIRO_CHECK_PTHREAD is expanded from...<br />build/configure.ac.pthread:189: CAIRO_CONFIGURE_PTHREAD is expanded from...<br />../../lib/m4sugar/m4sh.m4:606: AS_IF is expanded from...<br />../../lib/autoconf/general.m4:2032: AC_CACHE_VAL is expanded from...<br />../../lib/autoconf/general.m4:2053: AC_CACHE_CHECK is expanded from...<br />../../lib/m4sugar/m4sh.m4:517: AS_CASE is expanded from...<br />build/aclocal.enable.m4:41: _CAIRO_ENABLE is expanded from...<br />build/configure.ac.features:23: CAIRO_ENABLE is expanded from...<br />configure.ac:646: the top level<br />configure.ac:16: warning: AC_LANG_CONFTEST: no AC_LANG_SOURCE call detected in body<br />../../lib/autoconf/lang.m4:194: AC_LANG_CONFTEST is expanded from...<br />../../lib/autoconf/general.m4:2662: _AC_LINK_IFELSE is expanded from...<br />../../lib/autoconf/general.m4:2679: AC_LINK_IFELSE is expanded from...<br />build/libtool.m4:1022: _LT_SYS_MODULE_PATH_AIX is expanded from...<br />build/libtool.m4:4170: _LT_LINKER_SHLIBS is expanded from...<br />build/libtool.m4:5253: _LT_LANG_C_CONFIG is expanded from...<br />build/libtool.m4:138: _LT_SETUP is expanded from...<br />build/libtool.m4:67: LT_INIT is expanded from...<br />build/libtool.m4:102: AC_PROG_LIBTOOL is expanded from...<br />configure.ac:16: the top level<br />configure.ac:16: warning: AC_LANG_CONFTEST: no AC_LANG_SOURCE call detected in body<br />../../lib/autoconf/lang.m4:194: AC_LANG_CONFTEST is expanded from...<br />../../lib/autoconf/general.m4:2662: _AC_LINK_IFELSE is expanded from...<br />../../lib/autoconf/general.m4:2679: AC_LINK_IFELSE is expanded from...<br />build/libtool.m4:4170: _LT_LINKER_SHLIBS is expanded from...<br />build/libtool.m4:5253: _LT_LANG_C_CONFIG is expanded from...<br />build/libtool.m4:138: _LT_SETUP is expanded from...<br />build/libtool.m4:67: LT_INIT is expanded from...<br />build/libtool.m4:102: AC_PROG_LIBTOOL is expanded from...<br />configure.ac:16: the top level<br />build/configure.ac.tools:7: warning: AC_LANG_CONFTEST: no AC_LANG_SOURCE call detected in body<br />../../lib/autoconf/lang.m4:194: AC_LANG_CONFTEST is expanded from...<br />../../lib/autoconf/general.m4:2662: _AC_LINK_IFELSE is expanded from...<br />../../lib/autoconf/general.m4:2679: AC_LINK_IFELSE is expanded from...<br />build/libtool.m4:1022: _LT_SYS_MODULE_PATH_AIX is expanded from...<br />build/libtool.m4:5360: _LT_LANG_CXX_CONFIG is expanded from...<br />build/libtool.m4:785: _LT_LANG is expanded from...<br />build/libtool.m4:768: LT_LANG is expanded from...<br />build/configure.ac.tools:7: the top level<br />build/configure.ac.warnings:39: warning: AC_LANG_CONFTEST: no AC_LANG_SOURCE call detected in body<br />../../lib/autoconf/lang.m4:194: AC_LANG_CONFTEST is expanded from...<br />../../lib/autoconf/general.m4:2662: _AC_LINK_IFELSE is expanded from...<br />../../lib/autoconf/general.m4:2679: AC_LINK_IFELSE is expanded from...<br />build/aclocal.cairo.m4:89: CAIRO_CC_TRY_LINK_WITH_ENV_SILENT is expanded from...<br />build/aclocal.cairo.m4:124: CAIRO_CC_TRY_FLAG_SILENT is expanded from...<br />build/aclocal.cairo.m4:131: CAIRO_CC_CHECK_WERROR is expanded from...<br />build/aclocal.cairo.m4:148: CAIRO_CC_TRY_FLAG is expanded from...<br />../../lib/m4sugar/m4sh.m4:606: AS_IF is expanded from...<br />../../lib/autoconf/general.m4:2032: AC_CACHE_VAL is expanded from...<br />../../lib/autoconf/general.m4:2053: AC_CACHE_CHECK is expanded from...<br />build/configure.ac.warnings:39: the top level<br />build/configure.ac.warnings:39: warning: AC_LANG_CONFTEST: no AC_LANG_SOURCE call detected in body<br />../../lib/autoconf/lang.m4:194: AC_LANG_CONFTEST is expanded from...<br />../../lib/autoconf/general.m4:2662: _AC_LINK_IFELSE is expanded from...<br />../../lib/autoconf/general.m4:2679: AC_LINK_IFELSE is expanded from...<br />build/aclocal.cairo.m4:89: CAIRO_CC_TRY_LINK_WITH_ENV_SILENT is expanded from...<br />build/aclocal.cairo.m4:124: CAIRO_CC_TRY_FLAG_SILENT is expanded from...<br />build/aclocal.cairo.m4:148: CAIRO_CC_TRY_FLAG is expanded from...<br />../../lib/m4sugar/m4sh.m4:606: AS_IF is expanded from...<br />../../lib/autoconf/general.m4:2032: AC_CACHE_VAL is expanded from...<br />../../lib/autoconf/general.m4:2053: AC_CACHE_CHECK is expanded from...<br />build/configure.ac.warnings:39: the top level<br />build/configure.ac.warnings:69: warning: AC_LANG_CONFTEST: no AC_LANG_SOURCE call detected in body<br />../../lib/autoconf/lang.m4:194: AC_LANG_CONFTEST is expanded from...<br />../../lib/autoconf/general.m4:2662: _AC_LINK_IFELSE is expanded from...<br />../../lib/autoconf/general.m4:2679: AC_LINK_IFELSE is expanded from...<br />build/aclocal.cairo.m4:89: CAIRO_CC_TRY_LINK_WITH_ENV_SILENT is expanded from...<br />build/aclocal.cairo.m4:124: CAIRO_CC_TRY_FLAG_SILENT is expanded from...<br />../../lib/m4sugar/m4sh.m4:606: AS_IF is expanded from...<br />../../lib/autoconf/general.m4:2032: AC_CACHE_VAL is expanded from...<br />../../lib/autoconf/general.m4:2053: AC_CACHE_CHECK is expanded from...<br />build/configure.ac.warnings:69: the top level<br />build/configure.ac.warnings:83: warning: AC_LANG_CONFTEST: no AC_LANG_SOURCE call detected in body<br />../../lib/autoconf/lang.m4:194: AC_LANG_CONFTEST is expanded from...<br />../../lib/autoconf/general.m4:2662: _AC_LINK_IFELSE is expanded from...<br />../../lib/autoconf/general.m4:2679: AC_LINK_IFELSE is expanded from...<br />build/aclocal.cairo.m4:89: CAIRO_CC_TRY_LINK_WITH_ENV_SILENT is expanded from...<br />build/aclocal.cairo.m4:124: CAIRO_CC_TRY_FLAG_SILENT is expanded from...<br />build/aclocal.cairo.m4:131: CAIRO_CC_CHECK_WERROR is expanded from...<br />build/aclocal.cairo.m4:148: CAIRO_CC_TRY_FLAG is expanded from...<br />../../lib/m4sugar/m4sh.m4:606: AS_IF is expanded from...<br />../../lib/autoconf/general.m4:2032: AC_CACHE_VAL is expanded from...<br />../../lib/autoconf/general.m4:2053: AC_CACHE_CHECK is expanded from...<br />build/configure.ac.warnings:83: the top level<br />build/configure.ac.warnings:83: warning: AC_LANG_CONFTEST: no AC_LANG_SOURCE call detected in body<br />../../lib/autoconf/lang.m4:194: AC_LANG_CONFTEST is expanded from...<br />../../lib/autoconf/general.m4:2662: _AC_LINK_IFELSE is expanded from...<br />../../lib/autoconf/general.m4:2679: AC_LINK_IFELSE is expanded from...<br />build/aclocal.cairo.m4:89: CAIRO_CC_TRY_LINK_WITH_ENV_SILENT is expanded from...<br />build/aclocal.cairo.m4:124: CAIRO_CC_TRY_FLAG_SILENT is expanded from...<br />build/aclocal.cairo.m4:148: CAIRO_CC_TRY_FLAG is expanded from...<br />../../lib/m4sugar/m4sh.m4:606: AS_IF is expanded from...<br />../../lib/autoconf/general.m4:2032: AC_CACHE_VAL is expanded from...<br />../../lib/autoconf/general.m4:2053: AC_CACHE_CHECK is expanded from...<br />build/configure.ac.warnings:83: the top level<br />build/configure.ac.analysis:75: warning: AC_LANG_CONFTEST: no AC_LANG_SOURCE call detected in body<br />../../lib/autoconf/lang.m4:194: AC_LANG_CONFTEST is expanded from...<br />../../lib/autoconf/general.m4:2662: _AC_LINK_IFELSE is expanded from...<br />../../lib/autoconf/general.m4:2679: AC_LINK_IFELSE is expanded from...<br />build/aclocal.cairo.m4:89: CAIRO_CC_TRY_LINK_WITH_ENV_SILENT is expanded from...<br />build/aclocal.cairo.m4:124: CAIRO_CC_TRY_FLAG_SILENT is expanded from...<br />build/aclocal.cairo.m4:131: CAIRO_CC_CHECK_WERROR is expanded from...<br />build/aclocal.cairo.m4:148: CAIRO_CC_TRY_FLAG is expanded from...<br />build/configure.ac.analysis:75: the top level<br />build/configure.ac.analysis:75: warning: AC_LANG_CONFTEST: no AC_LANG_SOURCE call detected in body<br />../../lib/autoconf/lang.m4:194: AC_LANG_CONFTEST is expanded from...<br />../../lib/autoconf/general.m4:2662: _AC_LINK_IFELSE is expanded from...<br />../../lib/autoconf/general.m4:2679: AC_LINK_IFELSE is expanded from...<br />build/aclocal.cairo.m4:89: CAIRO_CC_TRY_LINK_WITH_ENV_SILENT is expanded from...<br />build/aclocal.cairo.m4:124: CAIRO_CC_TRY_FLAG_SILENT is expanded from...<br />build/aclocal.cairo.m4:148: CAIRO_CC_TRY_FLAG is expanded from...<br />build/configure.ac.analysis:75: the top level<br />configure.ac:646: warning: AC_LANG_CONFTEST: no AC_LANG_SOURCE call detected in body<br />../../lib/autoconf/lang.m4:194: AC_LANG_CONFTEST is expanded from...<br />../../lib/autoconf/general.m4:2662: _AC_LINK_IFELSE is expanded from...<br />../../lib/autoconf/general.m4:2679: AC_LINK_IFELSE is expanded from...<br />build/aclocal.cairo.m4:89: CAIRO_CC_TRY_LINK_WITH_ENV_SILENT is expanded from...<br />build/configure.ac.pthread:136: CAIRO_CHECK_PTHREAD is expanded from...<br />build/configure.ac.pthread:189: CAIRO_CONFIGURE_PTHREAD is expanded from...<br />../../lib/m4sugar/m4sh.m4:606: AS_IF is expanded from...<br />../../lib/autoconf/general.m4:2032: AC_CACHE_VAL is expanded from...<br />../../lib/autoconf/general.m4:2053: AC_CACHE_CHECK is expanded from...<br />../../lib/m4sugar/m4sh.m4:517: AS_CASE is expanded from...<br />build/aclocal.enable.m4:41: _CAIRO_ENABLE is expanded from...<br />build/configure.ac.features:23: CAIRO_ENABLE is expanded from...<br />configure.ac:646: the top level<br />libtoolize: putting auxiliary files in AC_CONFIG_AUX_DIR, `build&#039;.<br />libtoolize: copying file `build/ltmain.sh&#039;<br />libtoolize: putting macros in AC_CONFIG_MACRO_DIR, `build&#039;.<br />libtoolize: copying file `build/libtool.m4&#039;<br />libtoolize: copying file `build/ltoptions.m4&#039;<br />libtoolize: copying file `build/ltsugar.m4&#039;<br />libtoolize: copying file `build/ltversion.m4&#039;<br />libtoolize: copying file `build/lt~obsolete.m4&#039;<br />build/configure.ac.warnings:39: warning: AC_LANG_CONFTEST: no AC_LANG_SOURCE call detected in body<br />../../lib/autoconf/lang.m4:194: AC_LANG_CONFTEST is expanded from...<br />../../lib/autoconf/general.m4:2662: _AC_LINK_IFELSE is expanded from...<br />../../lib/autoconf/general.m4:2679: AC_LINK_IFELSE is expanded from...<br />build/aclocal.cairo.m4:89: CAIRO_CC_TRY_LINK_WITH_ENV_SILENT is expanded from...<br />build/aclocal.cairo.m4:124: CAIRO_CC_TRY_FLAG_SILENT is expanded from...<br />build/aclocal.cairo.m4:131: CAIRO_CC_CHECK_WERROR is expanded from...<br />build/aclocal.cairo.m4:148: CAIRO_CC_TRY_FLAG is expanded from...<br />../../lib/m4sugar/m4sh.m4:606: AS_IF is expanded from...<br />../../lib/autoconf/general.m4:2032: AC_CACHE_VAL is expanded from...<br />../../lib/autoconf/general.m4:2053: AC_CACHE_CHECK is expanded from...<br />build/configure.ac.warnings:39: the top level<br />build/configure.ac.warnings:39: warning: AC_LANG_CONFTEST: no AC_LANG_SOURCE call detected in body<br />../../lib/autoconf/lang.m4:194: AC_LANG_CONFTEST is expanded from...<br />../../lib/autoconf/general.m4:2662: _AC_LINK_IFELSE is expanded from...<br />../../lib/autoconf/general.m4:2679: AC_LINK_IFELSE is expanded from...<br />build/aclocal.cairo.m4:89: CAIRO_CC_TRY_LINK_WITH_ENV_SILENT is expanded from...<br />build/aclocal.cairo.m4:124: CAIRO_CC_TRY_FLAG_SILENT is expanded from...<br />build/aclocal.cairo.m4:148: CAIRO_CC_TRY_FLAG is expanded from...<br />../../lib/m4sugar/m4sh.m4:606: AS_IF is expanded from...<br />../../lib/autoconf/general.m4:2032: AC_CACHE_VAL is expanded from...<br />../../lib/autoconf/general.m4:2053: AC_CACHE_CHECK is expanded from...<br />build/configure.ac.warnings:39: the top level<br />build/configure.ac.warnings:69: warning: AC_LANG_CONFTEST: no AC_LANG_SOURCE call detected in body<br />../../lib/autoconf/lang.m4:194: AC_LANG_CONFTEST is expanded from...<br />../../lib/autoconf/general.m4:2662: _AC_LINK_IFELSE is expanded from...<br />../../lib/autoconf/general.m4:2679: AC_LINK_IFELSE is expanded from...<br />build/aclocal.cairo.m4:89: CAIRO_CC_TRY_LINK_WITH_ENV_SILENT is expanded from...<br />build/aclocal.cairo.m4:124: CAIRO_CC_TRY_FLAG_SILENT is expanded from...<br />../../lib/m4sugar/m4sh.m4:606: AS_IF is expanded from...<br />../../lib/autoconf/general.m4:2032: AC_CACHE_VAL is expanded from...<br />../../lib/autoconf/general.m4:2053: AC_CACHE_CHECK is expanded from...<br />build/configure.ac.warnings:69: the top level<br />build/configure.ac.warnings:83: warning: AC_LANG_CONFTEST: no AC_LANG_SOURCE call detected in body<br />../../lib/autoconf/lang.m4:194: AC_LANG_CONFTEST is expanded from...<br />../../lib/autoconf/general.m4:2662: _AC_LINK_IFELSE is expanded from...<br />../../lib/autoconf/general.m4:2679: AC_LINK_IFELSE is expanded from...<br />build/aclocal.cairo.m4:89: CAIRO_CC_TRY_LINK_WITH_ENV_SILENT is expanded from...<br />build/aclocal.cairo.m4:124: CAIRO_CC_TRY_FLAG_SILENT is expanded from...<br />build/aclocal.cairo.m4:131: CAIRO_CC_CHECK_WERROR is expanded from...<br />build/aclocal.cairo.m4:148: CAIRO_CC_TRY_FLAG is expanded from...<br />../../lib/m4sugar/m4sh.m4:606: AS_IF is expanded from...<br />../../lib/autoconf/general.m4:2032: AC_CACHE_VAL is expanded from...<br />../../lib/autoconf/general.m4:2053: AC_CACHE_CHECK is expanded from...<br />build/configure.ac.warnings:83: the top level<br />build/configure.ac.warnings:83: warning: AC_LANG_CONFTEST: no AC_LANG_SOURCE call detected in body<br />../../lib/autoconf/lang.m4:194: AC_LANG_CONFTEST is expanded from...<br />../../lib/autoconf/general.m4:2662: _AC_LINK_IFELSE is expanded from...<br />../../lib/autoconf/general.m4:2679: AC_LINK_IFELSE is expanded from...<br />build/aclocal.cairo.m4:89: CAIRO_CC_TRY_LINK_WITH_ENV_SILENT is expanded from...<br />build/aclocal.cairo.m4:124: CAIRO_CC_TRY_FLAG_SILENT is expanded from...<br />build/aclocal.cairo.m4:148: CAIRO_CC_TRY_FLAG is expanded from...<br />../../lib/m4sugar/m4sh.m4:606: AS_IF is expanded from...<br />../../lib/autoconf/general.m4:2032: AC_CACHE_VAL is expanded from...<br />../../lib/autoconf/general.m4:2053: AC_CACHE_CHECK is expanded from...<br />build/configure.ac.warnings:83: the top level<br />build/configure.ac.analysis:75: warning: AC_LANG_CONFTEST: no AC_LANG_SOURCE call detected in body<br />../../lib/autoconf/lang.m4:194: AC_LANG_CONFTEST is expanded from...<br />../../lib/autoconf/general.m4:2662: _AC_LINK_IFELSE is expanded from...<br />../../lib/autoconf/general.m4:2679: AC_LINK_IFELSE is expanded from...<br />build/aclocal.cairo.m4:89: CAIRO_CC_TRY_LINK_WITH_ENV_SILENT is expanded from...<br />build/aclocal.cairo.m4:124: CAIRO_CC_TRY_FLAG_SILENT is expanded from...<br />build/aclocal.cairo.m4:131: CAIRO_CC_CHECK_WERROR is expanded from...<br />build/aclocal.cairo.m4:148: CAIRO_CC_TRY_FLAG is expanded from...<br />build/configure.ac.analysis:75: the top level<br />build/configure.ac.analysis:75: warning: AC_LANG_CONFTEST: no AC_LANG_SOURCE call detected in body<br />../../lib/autoconf/lang.m4:194: AC_LANG_CONFTEST is expanded from...<br />../../lib/autoconf/general.m4:2662: _AC_LINK_IFELSE is expanded from...<br />../../lib/autoconf/general.m4:2679: AC_LINK_IFELSE is expanded from...<br />build/aclocal.cairo.m4:89: CAIRO_CC_TRY_LINK_WITH_ENV_SILENT is expanded from...<br />build/aclocal.cairo.m4:124: CAIRO_CC_TRY_FLAG_SILENT is expanded from...<br />build/aclocal.cairo.m4:148: CAIRO_CC_TRY_FLAG is expanded from...<br />build/configure.ac.analysis:75: the top level<br />configure.ac:646: warning: AC_LANG_CONFTEST: no AC_LANG_SOURCE call detected in body<br />../../lib/autoconf/lang.m4:194: AC_LANG_CONFTEST is expanded from...<br />../../lib/autoconf/general.m4:2662: _AC_LINK_IFELSE is expanded from...<br />../../lib/autoconf/general.m4:2679: AC_LINK_IFELSE is expanded from...<br />build/aclocal.cairo.m4:89: CAIRO_CC_TRY_LINK_WITH_ENV_SILENT is expanded from...<br />build/configure.ac.pthread:136: CAIRO_CHECK_PTHREAD is expanded from...<br />build/configure.ac.pthread:189: CAIRO_CONFIGURE_PTHREAD is expanded from...<br />../../lib/m4sugar/m4sh.m4:606: AS_IF is expanded from...<br />../../lib/autoconf/general.m4:2032: AC_CACHE_VAL is expanded from...<br />../../lib/autoconf/general.m4:2053: AC_CACHE_CHECK is expanded from...<br />../../lib/m4sugar/m4sh.m4:517: AS_CASE is expanded from...<br />build/aclocal.enable.m4:41: _CAIRO_ENABLE is expanded from...<br />build/configure.ac.features:23: CAIRO_ENABLE is expanded from...<br />configure.ac:646: the top level<br />build/configure.ac.warnings:39: warning: AC_LANG_CONFTEST: no AC_LANG_SOURCE call detected in body<br />../../lib/autoconf/lang.m4:194: AC_LANG_CONFTEST is expanded from...<br />../../lib/autoconf/general.m4:2662: _AC_LINK_IFELSE is expanded from...<br />../../lib/autoconf/general.m4:2679: AC_LINK_IFELSE is expanded from...<br />build/aclocal.cairo.m4:89: CAIRO_CC_TRY_LINK_WITH_ENV_SILENT is expanded from...<br />build/aclocal.cairo.m4:124: CAIRO_CC_TRY_FLAG_SILENT is expanded from...<br />build/aclocal.cairo.m4:131: CAIRO_CC_CHECK_WERROR is expanded from...<br />build/aclocal.cairo.m4:148: CAIRO_CC_TRY_FLAG is expanded from...<br />../../lib/m4sugar/m4sh.m4:606: AS_IF is expanded from...<br />../../lib/autoconf/general.m4:2032: AC_CACHE_VAL is expanded from...<br />../../lib/autoconf/general.m4:2053: AC_CACHE_CHECK is expanded from...<br />build/configure.ac.warnings:39: the top level<br />build/configure.ac.warnings:39: warning: AC_LANG_CONFTEST: no AC_LANG_SOURCE call detected in body<br />../../lib/autoconf/lang.m4:194: AC_LANG_CONFTEST is expanded from...<br />../../lib/autoconf/general.m4:2662: _AC_LINK_IFELSE is expanded from...<br />../../lib/autoconf/general.m4:2679: AC_LINK_IFELSE is expanded from...<br />build/aclocal.cairo.m4:89: CAIRO_CC_TRY_LINK_WITH_ENV_SILENT is expanded from...<br />build/aclocal.cairo.m4:124: CAIRO_CC_TRY_FLAG_SILENT is expanded from...<br />build/aclocal.cairo.m4:148: CAIRO_CC_TRY_FLAG is expanded from...<br />../../lib/m4sugar/m4sh.m4:606: AS_IF is expanded from...<br />../../lib/autoconf/general.m4:2032: AC_CACHE_VAL is expanded from...<br />../../lib/autoconf/general.m4:2053: AC_CACHE_CHECK is expanded from...<br />build/configure.ac.warnings:39: the top level<br />build/configure.ac.warnings:69: warning: AC_LANG_CONFTEST: no AC_LANG_SOURCE call detected in body<br />../../lib/autoconf/lang.m4:194: AC_LANG_CONFTEST is expanded from...<br />../../lib/autoconf/general.m4:2662: _AC_LINK_IFELSE is expanded from...<br />../../lib/autoconf/general.m4:2679: AC_LINK_IFELSE is expanded from...<br />build/aclocal.cairo.m4:89: CAIRO_CC_TRY_LINK_WITH_ENV_SILENT is expanded from...<br />build/aclocal.cairo.m4:124: CAIRO_CC_TRY_FLAG_SILENT is expanded from...<br />../../lib/m4sugar/m4sh.m4:606: AS_IF is expanded from...<br />../../lib/autoconf/general.m4:2032: AC_CACHE_VAL is expanded from...<br />../../lib/autoconf/general.m4:2053: AC_CACHE_CHECK is expanded from...<br />build/configure.ac.warnings:69: the top level<br />build/configure.ac.warnings:83: warning: AC_LANG_CONFTEST: no AC_LANG_SOURCE call detected in body<br />../../lib/autoconf/lang.m4:194: AC_LANG_CONFTEST is expanded from...<br />../../lib/autoconf/general.m4:2662: _AC_LINK_IFELSE is expanded from...<br />../../lib/autoconf/general.m4:2679: AC_LINK_IFELSE is expanded from...<br />build/aclocal.cairo.m4:89: CAIRO_CC_TRY_LINK_WITH_ENV_SILENT is expanded from...<br />build/aclocal.cairo.m4:124: CAIRO_CC_TRY_FLAG_SILENT is expanded from...<br />build/aclocal.cairo.m4:131: CAIRO_CC_CHECK_WERROR is expanded from...<br />build/aclocal.cairo.m4:148: CAIRO_CC_TRY_FLAG is expanded from...<br />../../lib/m4sugar/m4sh.m4:606: AS_IF is expanded from...<br />../../lib/autoconf/general.m4:2032: AC_CACHE_VAL is expanded from...<br />../../lib/autoconf/general.m4:2053: AC_CACHE_CHECK is expanded from...<br />build/configure.ac.warnings:83: the top level<br />build/configure.ac.warnings:83: warning: AC_LANG_CONFTEST: no AC_LANG_SOURCE call detected in body<br />../../lib/autoconf/lang.m4:194: AC_LANG_CONFTEST is expanded from...<br />../../lib/autoconf/general.m4:2662: _AC_LINK_IFELSE is expanded from...<br />../../lib/autoconf/general.m4:2679: AC_LINK_IFELSE is expanded from...<br />build/aclocal.cairo.m4:89: CAIRO_CC_TRY_LINK_WITH_ENV_SILENT is expanded from...<br />build/aclocal.cairo.m4:124: CAIRO_CC_TRY_FLAG_SILENT is expanded from...<br />build/aclocal.cairo.m4:148: CAIRO_CC_TRY_FLAG is expanded from...<br />../../lib/m4sugar/m4sh.m4:606: AS_IF is expanded from...<br />../../lib/autoconf/general.m4:2032: AC_CACHE_VAL is expanded from...<br />../../lib/autoconf/general.m4:2053: AC_CACHE_CHECK is expanded from...<br />build/configure.ac.warnings:83: the top level<br />build/configure.ac.analysis:75: warning: AC_LANG_CONFTEST: no AC_LANG_SOURCE call detected in body<br />../../lib/autoconf/lang.m4:194: AC_LANG_CONFTEST is expanded from...<br />../../lib/autoconf/general.m4:2662: _AC_LINK_IFELSE is expanded from...<br />../../lib/autoconf/general.m4:2679: AC_LINK_IFELSE is expanded from...<br />build/aclocal.cairo.m4:89: CAIRO_CC_TRY_LINK_WITH_ENV_SILENT is expanded from...<br />build/aclocal.cairo.m4:124: CAIRO_CC_TRY_FLAG_SILENT is expanded from...<br />build/aclocal.cairo.m4:131: CAIRO_CC_CHECK_WERROR is expanded from...<br />build/aclocal.cairo.m4:148: CAIRO_CC_TRY_FLAG is expanded from...<br />build/configure.ac.analysis:75: the top level<br />build/configure.ac.analysis:75: warning: AC_LANG_CONFTEST: no AC_LANG_SOURCE call detected in body<br />../../lib/autoconf/lang.m4:194: AC_LANG_CONFTEST is expanded from...<br />../../lib/autoconf/general.m4:2662: _AC_LINK_IFELSE is expanded from...<br />../../lib/autoconf/general.m4:2679: AC_LINK_IFELSE is expanded from...<br />build/aclocal.cairo.m4:89: CAIRO_CC_TRY_LINK_WITH_ENV_SILENT is expanded from...<br />build/aclocal.cairo.m4:124: CAIRO_CC_TRY_FLAG_SILENT is expanded from...<br />build/aclocal.cairo.m4:148: CAIRO_CC_TRY_FLAG is expanded from...<br />build/configure.ac.analysis:75: the top level<br />configure.ac:646: warning: AC_LANG_CONFTEST: no AC_LANG_SOURCE call detected in body<br />../../lib/autoconf/lang.m4:194: AC_LANG_CONFTEST is expanded from...<br />../../lib/autoconf/general.m4:2662: _AC_LINK_IFELSE is expanded from...<br />../../lib/autoconf/general.m4:2679: AC_LINK_IFELSE is expanded from...<br />build/aclocal.cairo.m4:89: CAIRO_CC_TRY_LINK_WITH_ENV_SILENT is expanded from...<br />build/configure.ac.pthread:136: CAIRO_CHECK_PTHREAD is expanded from...<br />build/configure.ac.pthread:189: CAIRO_CONFIGURE_PTHREAD is expanded from...<br />../../lib/m4sugar/m4sh.m4:606: AS_IF is expanded from...<br />../../lib/autoconf/general.m4:2032: AC_CACHE_VAL is expanded from...<br />../../lib/autoconf/general.m4:2053: AC_CACHE_CHECK is expanded from...<br />../../lib/m4sugar/m4sh.m4:517: AS_CASE is expanded from...<br />build/aclocal.enable.m4:41: _CAIRO_ENABLE is expanded from...<br />build/configure.ac.features:23: CAIRO_ENABLE is expanded from...<br />configure.ac:646: the top level<br />build/configure.ac.warnings:39: warning: AC_LANG_CONFTEST: no AC_LANG_SOURCE call detected in body<br />../../lib/autoconf/lang.m4:194: AC_LANG_CONFTEST is expanded from...<br />../../lib/autoconf/general.m4:2662: _AC_LINK_IFELSE is expanded from...<br />../../lib/autoconf/general.m4:2679: AC_LINK_IFELSE is expanded from...<br />build/aclocal.cairo.m4:89: CAIRO_CC_TRY_LINK_WITH_ENV_SILENT is expanded from...<br />build/aclocal.cairo.m4:124: CAIRO_CC_TRY_FLAG_SILENT is expanded from...<br />build/aclocal.cairo.m4:131: CAIRO_CC_CHECK_WERROR is expanded from...<br />build/aclocal.cairo.m4:148: CAIRO_CC_TRY_FLAG is expanded from...<br />../../lib/m4sugar/m4sh.m4:606: AS_IF is expanded from...<br />../../lib/autoconf/general.m4:2032: AC_CACHE_VAL is expanded from...<br />../../lib/autoconf/general.m4:2053: AC_CACHE_CHECK is expanded from...<br />build/configure.ac.warnings:39: the top level<br />build/configure.ac.warnings:39: warning: AC_LANG_CONFTEST: no AC_LANG_SOURCE call detected in body<br />../../lib/autoconf/lang.m4:194: AC_LANG_CONFTEST is expanded from...<br />../../lib/autoconf/general.m4:2662: _AC_LINK_IFELSE is expanded from...<br />../../lib/autoconf/general.m4:2679: AC_LINK_IFELSE is expanded from...<br />build/aclocal.cairo.m4:89: CAIRO_CC_TRY_LINK_WITH_ENV_SILENT is expanded from...<br />build/aclocal.cairo.m4:124: CAIRO_CC_TRY_FLAG_SILENT is expanded from...<br />build/aclocal.cairo.m4:148: CAIRO_CC_TRY_FLAG is expanded from...<br />../../lib/m4sugar/m4sh.m4:606: AS_IF is expanded from...<br />../../lib/autoconf/general.m4:2032: AC_CACHE_VAL is expanded from...<br />../../lib/autoconf/general.m4:2053: AC_CACHE_CHECK is expanded from...<br />build/configure.ac.warnings:39: the top level<br />build/configure.ac.warnings:69: warning: AC_LANG_CONFTEST: no AC_LANG_SOURCE call detected in body<br />../../lib/autoconf/lang.m4:194: AC_LANG_CONFTEST is expanded from...<br />../../lib/autoconf/general.m4:2662: _AC_LINK_IFELSE is expanded from...<br />../../lib/autoconf/general.m4:2679: AC_LINK_IFELSE is expanded from...<br />build/aclocal.cairo.m4:89: CAIRO_CC_TRY_LINK_WITH_ENV_SILENT is expanded from...<br />build/aclocal.cairo.m4:124: CAIRO_CC_TRY_FLAG_SILENT is expanded from...<br />../../lib/m4sugar/m4sh.m4:606: AS_IF is expanded from...<br />../../lib/autoconf/general.m4:2032: AC_CACHE_VAL is expanded from...<br />../../lib/autoconf/general.m4:2053: AC_CACHE_CHECK is expanded from...<br />build/configure.ac.warnings:69: the top level<br />build/configure.ac.warnings:83: warning: AC_LANG_CONFTEST: no AC_LANG_SOURCE call detected in body<br />../../lib/autoconf/lang.m4:194: AC_LANG_CONFTEST is expanded from...<br />../../lib/autoconf/general.m4:2662: _AC_LINK_IFELSE is expanded from...<br />../../lib/autoconf/general.m4:2679: AC_LINK_IFELSE is expanded from...<br />build/aclocal.cairo.m4:89: CAIRO_CC_TRY_LINK_WITH_ENV_SILENT is expanded from...<br />build/aclocal.cairo.m4:124: CAIRO_CC_TRY_FLAG_SILENT is expanded from...<br />build/aclocal.cairo.m4:131: CAIRO_CC_CHECK_WERROR is expanded from...<br />build/aclocal.cairo.m4:148: CAIRO_CC_TRY_FLAG is expanded from...<br />../../lib/m4sugar/m4sh.m4:606: AS_IF is expanded from...<br />../../lib/autoconf/general.m4:2032: AC_CACHE_VAL is expanded from...<br />../../lib/autoconf/general.m4:2053: AC_CACHE_CHECK is expanded from...<br />build/configure.ac.warnings:83: the top level<br />build/configure.ac.warnings:83: warning: AC_LANG_CONFTEST: no AC_LANG_SOURCE call detected in body<br />../../lib/autoconf/lang.m4:194: AC_LANG_CONFTEST is expanded from...<br />../../lib/autoconf/general.m4:2662: _AC_LINK_IFELSE is expanded from...<br />../../lib/autoconf/general.m4:2679: AC_LINK_IFELSE is expanded from...<br />build/aclocal.cairo.m4:89: CAIRO_CC_TRY_LINK_WITH_ENV_SILENT is expanded from...<br />build/aclocal.cairo.m4:124: CAIRO_CC_TRY_FLAG_SILENT is expanded from...<br />build/aclocal.cairo.m4:148: CAIRO_CC_TRY_FLAG is expanded from...<br />../../lib/m4sugar/m4sh.m4:606: AS_IF is expanded from...<br />../../lib/autoconf/general.m4:2032: AC_CACHE_VAL is expanded from...<br />../../lib/autoconf/general.m4:2053: AC_CACHE_CHECK is expanded from...<br />build/configure.ac.warnings:83: the top level<br />build/configure.ac.analysis:75: warning: AC_LANG_CONFTEST: no AC_LANG_SOURCE call detected in body<br />../../lib/autoconf/lang.m4:194: AC_LANG_CONFTEST is expanded from...<br />../../lib/autoconf/general.m4:2662: _AC_LINK_IFELSE is expanded from...<br />../../lib/autoconf/general.m4:2679: AC_LINK_IFELSE is expanded from...<br />build/aclocal.cairo.m4:89: CAIRO_CC_TRY_LINK_WITH_ENV_SILENT is expanded from...<br />build/aclocal.cairo.m4:124: CAIRO_CC_TRY_FLAG_SILENT is expanded from...<br />build/aclocal.cairo.m4:131: CAIRO_CC_CHECK_WERROR is expanded from...<br />build/aclocal.cairo.m4:148: CAIRO_CC_TRY_FLAG is expanded from...<br />build/configure.ac.analysis:75: the top level<br />build/configure.ac.analysis:75: warning: AC_LANG_CONFTEST: no AC_LANG_SOURCE call detected in body<br />../../lib/autoconf/lang.m4:194: AC_LANG_CONFTEST is expanded from...<br />../../lib/autoconf/general.m4:2662: _AC_LINK_IFELSE is expanded from...<br />../../lib/autoconf/general.m4:2679: AC_LINK_IFELSE is expanded from...<br />build/aclocal.cairo.m4:89: CAIRO_CC_TRY_LINK_WITH_ENV_SILENT is expanded from...<br />build/aclocal.cairo.m4:124: CAIRO_CC_TRY_FLAG_SILENT is expanded from...<br />build/aclocal.cairo.m4:148: CAIRO_CC_TRY_FLAG is expanded from...<br />build/configure.ac.analysis:75: the top level<br />configure.ac:646: warning: AC_LANG_CONFTEST: no AC_LANG_SOURCE call detected in body<br />../../lib/autoconf/lang.m4:194: AC_LANG_CONFTEST is expanded from...<br />../../lib/autoconf/general.m4:2662: _AC_LINK_IFELSE is expanded from...<br />../../lib/autoconf/general.m4:2679: AC_LINK_IFELSE is expanded from...<br />build/aclocal.cairo.m4:89: CAIRO_CC_TRY_LINK_WITH_ENV_SILENT is expanded from...<br />build/configure.ac.pthread:136: CAIRO_CHECK_PTHREAD is expanded from...<br />build/configure.ac.pthread:189: CAIRO_CONFIGURE_PTHREAD is expanded from...<br />../../lib/m4sugar/m4sh.m4:606: AS_IF is expanded from...<br />../../lib/autoconf/general.m4:2032: AC_CACHE_VAL is expanded from...<br />../../lib/autoconf/general.m4:2053: AC_CACHE_CHECK is expanded from...<br />../../lib/m4sugar/m4sh.m4:517: AS_CASE is expanded from...<br />build/aclocal.enable.m4:41: _CAIRO_ENABLE is expanded from...<br />build/configure.ac.features:23: CAIRO_ENABLE is expanded from...<br />configure.ac:646: the top level<br />build/configure.ac.warnings:39: warning: AC_LANG_CONFTEST: no AC_LANG_SOURCE call detected in body<br />../../lib/autoconf/lang.m4:194: AC_LANG_CONFTEST is expanded from...<br />../../lib/autoconf/general.m4:2662: _AC_LINK_IFELSE is expanded from...<br />../../lib/autoconf/general.m4:2679: AC_LINK_IFELSE is expanded from...<br />build/aclocal.cairo.m4:89: CAIRO_CC_TRY_LINK_WITH_ENV_SILENT is expanded from...<br />build/aclocal.cairo.m4:124: CAIRO_CC_TRY_FLAG_SILENT is expanded from...<br />build/aclocal.cairo.m4:131: CAIRO_CC_CHECK_WERROR is expanded from...<br />build/aclocal.cairo.m4:148: CAIRO_CC_TRY_FLAG is expanded from...<br />../../lib/m4sugar/m4sh.m4:606: AS_IF is expanded from...<br />../../lib/autoconf/general.m4:2032: AC_CACHE_VAL is expanded from...<br />../../lib/autoconf/general.m4:2053: AC_CACHE_CHECK is expanded from...<br />build/configure.ac.warnings:39: the top level<br />build/configure.ac.warnings:39: warning: AC_LANG_CONFTEST: no AC_LANG_SOURCE call detected in body<br />../../lib/autoconf/lang.m4:194: AC_LANG_CONFTEST is expanded from...<br />../../lib/autoconf/general.m4:2662: _AC_LINK_IFELSE is expanded from...<br />../../lib/autoconf/general.m4:2679: AC_LINK_IFELSE is expanded from...<br />build/aclocal.cairo.m4:89: CAIRO_CC_TRY_LINK_WITH_ENV_SILENT is expanded from...<br />build/aclocal.cairo.m4:124: CAIRO_CC_TRY_FLAG_SILENT is expanded from...<br />build/aclocal.cairo.m4:148: CAIRO_CC_TRY_FLAG is expanded from...<br />../../lib/m4sugar/m4sh.m4:606: AS_IF is expanded from...<br />../../lib/autoconf/general.m4:2032: AC_CACHE_VAL is expanded from...<br />../../lib/autoconf/general.m4:2053: AC_CACHE_CHECK is expanded from...<br />build/configure.ac.warnings:39: the top level<br />build/configure.ac.warnings:69: warning: AC_LANG_CONFTEST: no AC_LANG_SOURCE call detected in body<br />../../lib/autoconf/lang.m4:194: AC_LANG_CONFTEST is expanded from...<br />../../lib/autoconf/general.m4:2662: _AC_LINK_IFELSE is expanded from...<br />../../lib/autoconf/general.m4:2679: AC_LINK_IFELSE is expanded from...<br />build/aclocal.cairo.m4:89: CAIRO_CC_TRY_LINK_WITH_ENV_SILENT is expanded from...<br />build/aclocal.cairo.m4:124: CAIRO_CC_TRY_FLAG_SILENT is expanded from...<br />../../lib/m4sugar/m4sh.m4:606: AS_IF is expanded from...<br />../../lib/autoconf/general.m4:2032: AC_CACHE_VAL is expanded from...<br />../../lib/autoconf/general.m4:2053: AC_CACHE_CHECK is expanded from...<br />build/configure.ac.warnings:69: the top level<br />build/configure.ac.warnings:83: warning: AC_LANG_CONFTEST: no AC_LANG_SOURCE call detected in body<br />../../lib/autoconf/lang.m4:194: AC_LANG_CONFTEST is expanded from...<br />../../lib/autoconf/general.m4:2662: _AC_LINK_IFELSE is expanded from...<br />../../lib/autoconf/general.m4:2679: AC_LINK_IFELSE is expanded from...<br />build/aclocal.cairo.m4:89: CAIRO_CC_TRY_LINK_WITH_ENV_SILENT is expanded from...<br />build/aclocal.cairo.m4:124: CAIRO_CC_TRY_FLAG_SILENT is expanded from...<br />build/aclocal.cairo.m4:131: CAIRO_CC_CHECK_WERROR is expanded from...<br />build/aclocal.cairo.m4:148: CAIRO_CC_TRY_FLAG is expanded from...<br />../../lib/m4sugar/m4sh.m4:606: AS_IF is expanded from...<br />../../lib/autoconf/general.m4:2032: AC_CACHE_VAL is expanded from...<br />../../lib/autoconf/general.m4:2053: AC_CACHE_CHECK is expanded from...<br />build/configure.ac.warnings:83: the top level<br />build/configure.ac.warnings:83: warning: AC_LANG_CONFTEST: no AC_LANG_SOURCE call detected in body<br />../../lib/autoconf/lang.m4:194: AC_LANG_CONFTEST is expanded from...<br />../../lib/autoconf/general.m4:2662: _AC_LINK_IFELSE is expanded from...<br />../../lib/autoconf/general.m4:2679: AC_LINK_IFELSE is expanded from...<br />build/aclocal.cairo.m4:89: CAIRO_CC_TRY_LINK_WITH_ENV_SILENT is expanded from...<br />build/aclocal.cairo.m4:124: CAIRO_CC_TRY_FLAG_SILENT is expanded from...<br />build/aclocal.cairo.m4:148: CAIRO_CC_TRY_FLAG is expanded from...<br />../../lib/m4sugar/m4sh.m4:606: AS_IF is expanded from...<br />../../lib/autoconf/general.m4:2032: AC_CACHE_VAL is expanded from...<br />../../lib/autoconf/general.m4:2053: AC_CACHE_CHECK is expanded from...<br />build/configure.ac.warnings:83: the top level<br />build/configure.ac.analysis:75: warning: AC_LANG_CONFTEST: no AC_LANG_SOURCE call detected in body<br />../../lib/autoconf/lang.m4:194: AC_LANG_CONFTEST is expanded from...<br />../../lib/autoconf/general.m4:2662: _AC_LINK_IFELSE is expanded from...<br />../../lib/autoconf/general.m4:2679: AC_LINK_IFELSE is expanded from...<br />build/aclocal.cairo.m4:89: CAIRO_CC_TRY_LINK_WITH_ENV_SILENT is expanded from...<br />build/aclocal.cairo.m4:124: CAIRO_CC_TRY_FLAG_SILENT is expanded from...<br />build/aclocal.cairo.m4:131: CAIRO_CC_CHECK_WERROR is expanded from...<br />build/aclocal.cairo.m4:148: CAIRO_CC_TRY_FLAG is expanded from...<br />build/configure.ac.analysis:75: the top level<br />build/configure.ac.analysis:75: warning: AC_LANG_CONFTEST: no AC_LANG_SOURCE call detected in body<br />../../lib/autoconf/lang.m4:194: AC_LANG_CONFTEST is expanded from...<br />../../lib/autoconf/general.m4:2662: _AC_LINK_IFELSE is expanded from...<br />../../lib/autoconf/general.m4:2679: AC_LINK_IFELSE is expanded from...<br />build/aclocal.cairo.m4:89: CAIRO_CC_TRY_LINK_WITH_ENV_SILENT is expanded from...<br />build/aclocal.cairo.m4:124: CAIRO_CC_TRY_FLAG_SILENT is expanded from...<br />build/aclocal.cairo.m4:148: CAIRO_CC_TRY_FLAG is expanded from...<br />build/configure.ac.analysis:75: the top level<br />configure.ac:646: warning: AC_LANG_CONFTEST: no AC_LANG_SOURCE call detected in body<br />../../lib/autoconf/lang.m4:194: AC_LANG_CONFTEST is expanded from...<br />../../lib/autoconf/general.m4:2662: _AC_LINK_IFELSE is expanded from...<br />../../lib/autoconf/general.m4:2679: AC_LINK_IFELSE is expanded from...<br />build/aclocal.cairo.m4:89: CAIRO_CC_TRY_LINK_WITH_ENV_SILENT is expanded from...<br />build/configure.ac.pthread:136: CAIRO_CHECK_PTHREAD is expanded from...<br />build/configure.ac.pthread:189: CAIRO_CONFIGURE_PTHREAD is expanded from...<br />../../lib/m4sugar/m4sh.m4:606: AS_IF is expanded from...<br />../../lib/autoconf/general.m4:2032: AC_CACHE_VAL is expanded from...<br />../../lib/autoconf/general.m4:2053: AC_CACHE_CHECK is expanded from...<br />../../lib/m4sugar/m4sh.m4:517: AS_CASE is expanded from...<br />build/aclocal.enable.m4:41: _CAIRO_ENABLE is expanded from...<br />build/configure.ac.features:23: CAIRO_ENABLE is expanded from...<br />configure.ac:646: the top level<br />test/Makefile.am:1735: `%&#039;-style pattern rules are a GNU make extension<br />test/Makefile.am:1736: &lt;: non-POSIX variable name<br />build/Makefile.am.changelog:57: `%&#039;-style pattern rules are a GNU make extension<br />Makefile.am:80:&nbsp; &nbsp;`build/Makefile.am.changelog&#039; included from here<br />patch -Np1 &lt; debian/ltmain_as-needed.patch<br />patching file build/ltmain.sh<br />Hunk #1 succeeded at 5800 (offset 1084 lines).<br />Hunk #2 FAILED at 5075.<br />1 out of 2 hunks FAILED -- saving rejects to file build/ltmain.sh.rej<br />make: *** [configure-common-stamp] Ошибка 1<br />dpkg-buildpackage: ошибка: debian/rules build возвратил код ошибки 2</p></div></div>]]></description>
			<author><![CDATA[null@example.com (SidER)]]></author>
			<pubDate>Fri, 18 Nov 2011 23:28:55 +0000</pubDate>
			<guid>https://linuxforum.ru/viewtopic.php?pid=226676#p226676</guid>
		</item>
		<item>
			<title><![CDATA[Re: Сказ о том как EvgeniusDragon на Debian переходил]]></title>
			<link>https://linuxforum.ru/viewtopic.php?pid=226673#p226673</link>
			<description><![CDATA[<p><strong>ABulychev</strong>, ну тогда я бы собрал разок без патча, потом с патчем и станет ясно кто виноват :-).</p>]]></description>
			<author><![CDATA[null@example.com (papin-aziat)]]></author>
			<pubDate>Fri, 18 Nov 2011 23:14:32 +0000</pubDate>
			<guid>https://linuxforum.ru/viewtopic.php?pid=226673#p226673</guid>
		</item>
		<item>
			<title><![CDATA[Re: Сказ о том как EvgeniusDragon на Debian переходил]]></title>
			<link>https://linuxforum.ru/viewtopic.php?pid=226671#p226671</link>
			<description><![CDATA[<div class="quotebox"><cite>papin-aziat пишет:</cite><blockquote><p><strong>ABulychev</strong>, а все остальные шаги без проблем? Все делал с нуля в чистом каталоге?</p></blockquote></div><p>Все предыдущие команды выполнялись без ошибок.Несколько раз делал с нуля и в новых каталогах.<br /></p><div class="quotebox"><cite>papin-aziat пишет:</cite><blockquote><p>Сборка идет от рута тогда -rfakeroot не надо.</p></blockquote></div><p>Это понял. Просто пробовал как от рута, так и от об.пользователя.</p>]]></description>
			<author><![CDATA[null@example.com (SidER)]]></author>
			<pubDate>Fri, 18 Nov 2011 22:16:26 +0000</pubDate>
			<guid>https://linuxforum.ru/viewtopic.php?pid=226671#p226671</guid>
		</item>
		<item>
			<title><![CDATA[Re: Сказ о том как EvgeniusDragon на Debian переходил]]></title>
			<link>https://linuxforum.ru/viewtopic.php?pid=226660#p226660</link>
			<description><![CDATA[<p><strong>ABulychev</strong>, а все остальные шаги без проблем? Все делал с нуля в чистом каталоге?<br /></p><div class="quotebox"><cite>ABulychev пишет:</cite><blockquote><p>dpkg-buildpackage: предупреждение: используется команда получения прав root, но уже есть права root</p></blockquote></div><p>Сборка идет от рута тогда -rfakeroot не надо.</p>]]></description>
			<author><![CDATA[null@example.com (papin-aziat)]]></author>
			<pubDate>Fri, 18 Nov 2011 20:15:12 +0000</pubDate>
			<guid>https://linuxforum.ru/viewtopic.php?pid=226660#p226660</guid>
		</item>
		<item>
			<title><![CDATA[Re: Сказ о том как EvgeniusDragon на Debian переходил]]></title>
			<link>https://linuxforum.ru/viewtopic.php?pid=226636#p226636</link>
			<description><![CDATA[<p><strong>papin-aziat</strong>, выхлоп после dpkg-buildpackage -rfakeroot :<br /></p><div class="fancy_spoiler_switcher"><div class="fancy_spoiler_switcher_header" data-lang-open="открыть спойлер" data-lang-close="скрыть спойлер"><strong>+</strong>&nbsp;открыть спойлер</div><div class="fancy_spoiler"><p>dpkg-buildpackage: предупреждение: используется команда получения прав root, но уже есть права root<br />dpkg-buildpackage: пакет исходных текстов cairo<br />dpkg-buildpackage: версия исходных текстов 1.10.2-6.1<br />dpkg-buildpackage: исходные тексты изменены Aurelien Jarno &lt;aurel32@debian.org&gt;<br />dpkg-buildpackage: архитектура узла i386<br /> dpkg-source --before-build cairo-1.10.2<br /> fakeroot debian/rules clean<br />dh_testdir<br />dh_testroot<br />[ ! -r src/cairo-features.h.orig ] || mv -f src/cairo-features.h.orig src/cairo-features.h<br />[ ! -r configure-common-stamp ] || patch -NRp1 &lt; debian/ltmain_as-needed.patch<br />rm -f *-stamp<br />rm -rf /home/abulychev/constructor/cairo-1.10.2/debian/build /home/abulychev/constructor/cairo-1.10.2/debian/install<br />dh_autoreconf_clean<br />dh_clean<br /> dpkg-source -b cairo-1.10.2<br />dpkg-source: инфо: используется формат исходника «3.0 (quilt)»<br />dpkg-source: инфо: сборка cairo с использованием существующего ./cairo_1.10.2.orig.tar.gz<br />dpkg-source: инфо: local changes detected, the modified files are:<br /> cairo-1.10.2/src/cairo-ft-font.c<br />dpkg-source: инфо: you can integrate the local changes with dpkg-source --commit<br />dpkg-source: ошибка: aborting due to unexpected upstream changes, see /tmp/cairo_1.10.2-6.1.diff.kbS_j3<br />dpkg-buildpackage: ошибка: dpkg-source -b cairo-1.10.2 возвратил код ошибки 2</p></div></div>]]></description>
			<author><![CDATA[null@example.com (SidER)]]></author>
			<pubDate>Fri, 18 Nov 2011 18:45:13 +0000</pubDate>
			<guid>https://linuxforum.ru/viewtopic.php?pid=226636#p226636</guid>
		</item>
		<item>
			<title><![CDATA[Re: Сказ о том как EvgeniusDragon на Debian переходил]]></title>
			<link>https://linuxforum.ru/viewtopic.php?pid=226634#p226634</link>
			<description><![CDATA[<p><strong>ABulychev</strong>, сделай так,&nbsp; и если не пойдет тогда вывод сюда.<br />wget -c <a href="http://www.sergeysl.ru/wp-content/uploads/freebsd/cairo-9999-cleartype.patch">http://www.sergeysl.ru/wp-content/uploa … type.patch</a><br />sudo apt-get -y install dpkg-dev devscripts fakeroot<br />apt-get source cairo<br />cd cairo*<br />patch -Np1 -i ../cairo-9999-cleartype.patch<br />apt-get build-dep cairo<br />dpkg-buildpackage -rfakeroot<br />cd ..<br />sudo dpkg -i libcairo2_*</p>]]></description>
			<author><![CDATA[null@example.com (papin-aziat)]]></author>
			<pubDate>Fri, 18 Nov 2011 18:35:11 +0000</pubDate>
			<guid>https://linuxforum.ru/viewtopic.php?pid=226634#p226634</guid>
		</item>
	</channel>
</rss>
