<?xml version="1.0" encoding="utf-8"?>
<rss version="2.0" xmlns:atom="http://www.w3.org/2005/Atom">
	<channel>
		<title><![CDATA[Linux Forum &mdash; Не могу установить logwatch]]></title>
		<link>https://linuxforum.ru/viewtopic.php?id=36885</link>
		<atom:link href="https://linuxforum.ru/extern.php?action=feed&amp;tid=36885&amp;type=rss" rel="self" type="application/rss+xml" />
		<description><![CDATA[Недавние сообщения в теме «Не могу установить logwatch».]]></description>
		<lastBuildDate>Sat, 29 Nov 2014 12:33:18 +0000</lastBuildDate>
		<generator>PunBB</generator>
		<item>
			<title><![CDATA[Re: Не могу установить logwatch]]></title>
			<link>https://linuxforum.ru/viewtopic.php?pid=433365#p433365</link>
			<description><![CDATA[<p>Решил проблему обновлением dev-perl/Locale-gettext</p>]]></description>
			<author><![CDATA[null@example.com (XliN)]]></author>
			<pubDate>Sat, 29 Nov 2014 12:33:18 +0000</pubDate>
			<guid>https://linuxforum.ru/viewtopic.php?pid=433365#p433365</guid>
		</item>
		<item>
			<title><![CDATA[Не могу установить logwatch]]></title>
			<link>https://linuxforum.ru/viewtopic.php?pid=433339#p433339</link>
			<description><![CDATA[<p>Ловлю вот такую ошибку<br /></p><div class="fancy_spoiler_switcher"><div class="fancy_spoiler_switcher_header" data-lang-open="открыть спойлер" data-lang-close="скрыть спойлер"><strong>+</strong>&nbsp;открыть спойлер</div><div class="fancy_spoiler"><p><div class="termtitle" style="font-family: sans-serif; position:relative; height:auto; width:auto; background:#3A4061; color:#FFFFFF; padding: 1px;"><b> Консоль:</b></div>
<div class="termcont" style="font-family: Terminus; position:relative; height:auto; width:auto; overflow-x:scroll; white-space: nowrap ; overflow-y:auto;background:#000000; color:#4EF44E; line-height:1.2; padding: 3px; font-size: 1rem; max-height: 60vh">make[3]: Leaving directory `/var/tmp/portage/dev-libs/libtasn1-3.6/work/libtasn1-3.6-abi_x86_64.amd64/examples&#039;<br />make[2]: Leaving directory `/var/tmp/portage/dev-libs/libtasn1-3.6/work/libtasn1-3.6-abi_x86_64.amd64/examples&#039;<br />Making all in tests<br />make[2]: Entering directory `/var/tmp/portage/dev-libs/libtasn1-3.6/work/libtasn1-3.6-abi_x86_64.amd64/tests&#039;<br />make[2]: Nothing to be done for `all&#039;.<br />make[2]: Leaving directory `/var/tmp/portage/dev-libs/libtasn1-3.6/work/libtasn1-3.6-abi_x86_64.amd64/tests&#039;<br />Making all in doc<br />make[2]: Entering directory `/var/tmp/portage/dev-libs/libtasn1-3.6/work/libtasn1-3.6-abi_x86_64.amd64/doc&#039;<br />Making all in cyclo<br />make[3]: Entering directory `/var/tmp/portage/dev-libs/libtasn1-3.6/work/libtasn1-3.6-abi_x86_64.amd64/doc/cyclo&#039;<br />make[3]: Nothing to be done for `all&#039;.<br />make[3]: Leaving directory `/var/tmp/portage/dev-libs/libtasn1-3.6/work/libtasn1-3.6-abi_x86_64.amd64/doc/cyclo&#039;<br />make[3]: Entering directory `/var/tmp/portage/dev-libs/libtasn1-3.6/work/libtasn1-3.6-abi_x86_64.amd64/doc&#039;<br />/bin/sh /var/tmp/portage/dev-libs/libtasn1-3.6/work/libtasn1-3.6/build-aux/missing help2man --info-page libtasn1 \<br />&nbsp; &nbsp; --name=&quot;ASN.1 syntax tree generator for libtasn1&quot; \<br />&nbsp; &nbsp; --output=asn1Parser.1 ../src/asn1Parser<br />/bin/sh /var/tmp/portage/dev-libs/libtasn1-3.6/work/libtasn1-3.6/build-aux/missing help2man --info-page libtasn1 \<br />&nbsp; &nbsp; --name=&quot;ASN.1 DER encoder&quot; \<br />&nbsp; &nbsp; --output=asn1Coding.1 ../src/asn1Coding<br />/bin/sh /var/tmp/portage/dev-libs/libtasn1-3.6/work/libtasn1-3.6/build-aux/missing help2man --info-page libtasn1 \<br />&nbsp; &nbsp; --name=&quot;ASN.1 DER decoder&quot; \<br />&nbsp; &nbsp; --output=asn1Decoding.1 ../src/asn1Decoding<br />Can&#039;t locate Locale/gettext.pm in @INC (@INC contains: /etc/perl /usr/local/lib64/perl5/5.16.3/x86_64-linux /usr/local/lib64/perl5/5.16.3 /usr/lib64/perl5/vendor_perl/5.16.3/x86_64-linux /usr/lib64/perl5/vendor_perl/5.16.3 /usr/local/lib64/perl5 /usr/lib64/perl5/vendor_perl /usr/lib64/perl5/5.16.3/x86_64-linux /usr/lib64/perl5/5.16.3 .) at /usr/bin/help2man line 28.<br />BEGIN failed--compilation aborted at /usr/bin/help2man line 28.<br />Can&#039;t locate Locale/gettext.pm in @INC (@INC contains: /etc/perl /usr/local/lib64/perl5/5.16.3/x86_64-linux /usr/local/lib64/perl5/5.16.3 /usr/lib64/perl5/vendor_perl/5.16.3/x86_64-linux /usr/lib64/perl5/vendor_perl/5.16.3 /usr/local/lib64/perl5 /usr/lib64/perl5/vendor_perl /usr/lib64/perl5/5.16.3/x86_64-linux /usr/lib64/perl5/5.16.3 .) at /usr/bin/help2man line 28.<br />BEGIN failed--compilation aborted at /usr/bin/help2man line 28.<br />make[3]: *** [asn1Parser.1] Error 2<br />make[3]: *** Waiting for unfinished jobs....<br />make[3]: *** [asn1Coding.1] Error 2<br />Can&#039;t locate Locale/gettext.pm in @INC (@INC contains: /etc/perl /usr/local/lib64/perl5/5.16.3/x86_64-linux /usr/local/lib64/perl5/5.16.3 /usr/lib64/perl5/vendor_perl/5.16.3/x86_64-linux /usr/lib64/perl5/vendor_perl/5.16.3 /usr/local/lib64/perl5 /usr/lib64/perl5/vendor_perl /usr/lib64/perl5/5.16.3/x86_64-linux /usr/lib64/perl5/5.16.3 .) at /usr/bin/help2man line 28.<br />BEGIN failed--compilation aborted at /usr/bin/help2man line 28.<br />make[3]: *** [asn1Decoding.1] Error 2<br />make[3]: Leaving directory `/var/tmp/portage/dev-libs/libtasn1-3.6/work/libtasn1-3.6-abi_x86_64.amd64/doc&#039;<br />make[2]: *** [all-recursive] Error 1<br />make[2]: Leaving directory `/var/tmp/portage/dev-libs/libtasn1-3.6/work/libtasn1-3.6-abi_x86_64.amd64/doc&#039;<br />make[1]: *** [all-recursive] Error 1<br />make[1]: Leaving directory `/var/tmp/portage/dev-libs/libtasn1-3.6/work/libtasn1-3.6-abi_x86_64.amd64&#039;<br />make: *** [all] Ошибка 2<br /> * ERROR: dev-libs/libtasn1-3.6::gentoo failed (compile phase):<br /> *&nbsp; &nbsp;emake failed<br /> * <br /> * If you need support, post the output of `emerge --info &#039;=dev-libs/libtasn1-3.6::gentoo&#039;`,<br /> * the complete build log and the output of `emerge -pqv &#039;=dev-libs/libtasn1-3.6::gentoo&#039;`.<br /> * The complete build log is located at &#039;/var/tmp/portage/dev-libs/libtasn1-3.6/temp/build.log&#039;.<br /> * The ebuild environment file is located at &#039;/var/tmp/portage/dev-libs/libtasn1-3.6/temp/environment&#039;.<br /> * Working directory: &#039;/var/tmp/portage/dev-libs/libtasn1-3.6/work/libtasn1-3.6-abi_x86_64.amd64&#039;<br /> * S: &#039;/var/tmp/portage/dev-libs/libtasn1-3.6/work/libtasn1-3.6&#039;</p><p>&gt;&gt;&gt; Failed to emerge dev-libs/libtasn1-3.6, Log file:</p><p>&gt;&gt;&gt;&nbsp; &#039;/var/tmp/portage/dev-libs/libtasn1-3.6/temp/build.log&#039;</p><p> * Messages for package dev-libs/libtasn1-3.6:</p><p> * ERROR: dev-libs/libtasn1-3.6::gentoo failed (compile phase):<br /> *&nbsp; &nbsp;emake failed<br /> * <br /> * If you need support, post the output of `emerge --info &#039;=dev-libs/libtasn1-3.6::gentoo&#039;`,<br /> * the complete build log and the output of `emerge -pqv &#039;=dev-libs/libtasn1-3.6::gentoo&#039;`.<br /> * The complete build log is located at &#039;/var/tmp/portage/dev-libs/libtasn1-3.6/temp/build.log&#039;.<br /> * The ebuild environment file is located at &#039;/var/tmp/portage/dev-libs/libtasn1-3.6/temp/environment&#039;.<br /> * Working directory: &#039;/var/tmp/portage/dev-libs/libtasn1-3.6/work/libtasn1-3.6-abi_x86_64.amd64&#039;<br /> * S: &#039;/var/tmp/portage/dev-libs/libtasn1-3.6/work/libtasn1-3.6&#039;</p><p> * GNU info directory index is up-to-date.</p><p> * IMPORTANT: 15 config files in &#039;/etc&#039; need updating.<br /> * See the CONFIGURATION FILES section of the emerge<br /> * man page to learn how to update config files.</p><p> * IMPORTANT: 5 news items need reading for repository &#039;gentoo&#039;.<br /> * Use eselect news to read news items.<br /></div></p></div></div><p>Полный лог <a href="https://bpaste.net/show/2056cfb170ec">https://bpaste.net/show/2056cfb170ec</a></p>]]></description>
			<author><![CDATA[null@example.com (XliN)]]></author>
			<pubDate>Sat, 29 Nov 2014 10:12:38 +0000</pubDate>
			<guid>https://linuxforum.ru/viewtopic.php?pid=433339#p433339</guid>
		</item>
	</channel>
</rss>
