1 (17.11.2010 18:54:39 отредактировано Lambre)

Здравствуй сообщество.

Все тривиально.
Желанный ATIS, и полное сопротивление системы.
Порядок действий:
1.Инсталл ATIS. Он, не смотря на отказ ставить модули подпихивает свой старый DKMS.
2. При обновление DKMS из репы, bash передает привет и говорит, что такая команда не найдена вообще  oO
3. Качаю DKMS с сайта DELL, устанавливаю через --force --nodeps, так как он ругается на необходимость modutils
4. Далее ставлю snapapi26 0.7.51, свежее пока нет наверное (пробовал 47)
5. Получаю отказ при попытке собрать модуль посредством DKMS

Error! Bad return status for module build on kernel: 2.6.33.7-desktop586-2mnb (i686)

6. Выполняю

 Консоль:
urpmi kernel-source-latest

и получаю ответ

Пакет kernel-source-latest-2.6.33.7-2mnb2.i586 уже установлен

вот make.log DKMS про модуль snapapi

DKMS make.log for snapapi26-0.7.51 for kernel 2.6.33.7-desktop586-2mnb (i686)
Пнд Ноя 15 14:32:16 MSK 2010
make: Entering directory `/usr/src/linux-2.6.33.7-desktop586-2mnb'
  CC [M]  /var/lib/dkms/snapapi26/0.7.51/build/snapapi26.o
/var/lib/dkms/snapapi26/0.7.51/build/snapapi26.c:9:28: error: linux/autoconf.h: Нет такого файла или каталога
/var/lib/dkms/snapapi26/0.7.51/build/snapapi26.c: В функции ‘snapapi_init’:
/var/lib/dkms/snapapi26/0.7.51/build/snapapi26.c:4079: предупреждение: метка ‘err_thread’ определена, но не используется
make[1]: *** [/var/lib/dkms/snapapi26/0.7.51/build/snapapi26.o] Ошибка 1
make: *** [_module_/var/lib/dkms/snapapi26/0.7.51/build] Ошибка 2
make: Leaving directory `/usr/src/linux-2.6.33.7-desktop586-2mnb'

С предыдущим релизом установка проходила за 5-ть минут и имела успех.
Буду рад помощи, или хотя бы совету куда смотреть.

2

up?

3 (02.12.2010 23:09:02 отредактировано Lambre)

Решено.

ключевое здесь
/var/lib/dkms/snapapi26/0.7.51/build/snapapi26.c:9:28: error: linux/autoconf.h: Нет такого файла или каталога

надо скопировать autoconf.h из

/usr/src/linux-текущая версия ядра/included/generated

в

/usr/src/linux-текущая версия ядра/included/linux