1

Приветствую всех. Хотел поставить KDEBase-Meta, но появилась проблема с установкой некоторых пакетов. В том числе и проблема с установкой плазмы:

[ 26%] Building CXX object plasma/generic/applets/digital-clock/CMakeFiles/plasma_applet_dig_clock.dir/clock.o
Linking CXX shared module ../../../../lib/plasma_applet_dig_clock.so
collect2: ld завершилась по сигналу 11 [Ошибка сегментирования]
make[2]: *** [lib/plasma_applet_dig_clock.so] Ошибка 1
make[1]: *** [plasma/generic/applets/digital-clock/CMakeFiles/plasma_applet_dig_clock.dir/all] Ошибка 2
make: *** [all] Ошибка 2
emake failed
 * ERROR: kde-base/plasma-workspace-4.4.5 failed (compile phase):
 *   Make failed!
 * 
 * Call stack:
 *     ebuild.sh, line   56:  Called src_compile
 *   environment, line 6565:  Called kde4-meta_src_compile
 *   environment, line 3897:  Called kde4-base_src_compile
 *   environment, line 3514:  Called cmake-utils_src_compile
 *   environment, line 1839:  Called _execute_optionaly 'src_compile'
 *   environment, line  793:  Called enable_cmake-utils_src_compile
 *   environment, line 2094:  Called cmake-utils_src_make
 *   environment, line 1858:  Called die
 * The specific snippet of code:
 *           emake "$@" || die "Make failed!";
 * 
 * If you need support, post the output of 'emerge --info =kde-base/plasma-workspace-4.4.5',
 * the complete build log and the output of 'emerge -pqv =kde-base/plasma-workspace-4.4.5'.
 * The complete build log is located at '/var/tmp/portage/kde-base/plasma-workspace-4.4.5/temp/build.log'.
 * The ebuild environment file is located at '/var/tmp/portage/kde-base/plasma-workspace-4.4.5/temp/environment'.
 * S: '/var/tmp/portage/kde-base/plasma-workspace-4.4.5/work/plasma-workspace-4.4.5'

>>> Failed to emerge kde-base/plasma-workspace-4.4.5, Log file:

>>>  '/var/tmp/portage/kde-base/plasma-workspace-4.4.5/temp/build.log'

 * Messages for package kde-base/plasma-workspace-4.4.5:

 * ERROR: kde-base/plasma-workspace-4.4.5 failed (compile phase):
 *   Make failed!
 * 
 * Call stack:
 *     ebuild.sh, line   56:  Called src_compile
 *   environment, line 6565:  Called kde4-meta_src_compile
 *   environment, line 3897:  Called kde4-base_src_compile
 *   environment, line 3514:  Called cmake-utils_src_compile
 *   environment, line 1839:  Called _execute_optionaly 'src_compile'
 *   environment, line  793:  Called enable_cmake-utils_src_compile
 *   environment, line 2094:  Called cmake-utils_src_make
 *   environment, line 1858:  Called die
 * The specific snippet of code:
 *           emake "$@" || die "Make failed!";
 * 
 * If you need support, post the output of 'emerge --info =kde-base/plasma-workspace-4.4.5',
 * the complete build log and the output of 'emerge -pqv =kde-base/plasma-workspace-4.4.5'.
 * The complete build log is located at '/var/tmp/portage/kde-base/plasma-workspace-4.4.5/temp/build.log'.
 * The ebuild environment file is located at '/var/tmp/portage/kde-base/plasma-workspace-4.4.5/temp/environment'.
 * S: '/var/tmp/portage/kde-base/plasma-workspace-4.4.5/work/plasma-workspace-4.4.5'

Выполнял emerge --sync && emerge portage, но бестолку - прерывание установки плазмы можде произойти на любом шаге. Такая же лажа и с многими другими пакетами - их удаётся поставить с раза пятого.
\Так вопрос: как плазму установить? З.Ы. в генту я новичёк полнейший.

2

santic, покажите вывод emerge --info, uname -a.
Проверьте исправность оперативной памяти.

Был, был и весь вышел...

3 (04.04.2011 13:01:39 отредактировано santic)

окей, cmake переставлю =) И да, на счёт памяти хорошая мысль - комп у меня виснет частенько. И в генте и в дебиане.

4

emerge --info

Your-PC santic # emerge --info
Portage 2.1.9.42 (default/linux/x86/10.0, gcc-4.4.5, glibc-2.11.3-r0, 2.6.36-gentoo-r8 i686)
=================================================================
System uname: Linux-2.6.36-gentoo-r8-i686-Pentium-R-_Dual-Core_CPU_E6300_@_2.80GHz-with-gentoo-1.12.14
Timestamp of tree: Mon, 04 Apr 2011 08:00:01 +0000
app-shells/bash:     4.1_p9
dev-lang/python:     2.6.6-r2, 3.1.3-r1
dev-util/cmake:      2.8.1-r2
sys-apps/baselayout: 1.12.14-r1
sys-apps/sandbox:    2.4
sys-devel/autoconf:  2.13, 2.65-r1
sys-devel/automake:  1.10.3, 1.11.1
sys-devel/binutils:  2.20.1-r1
sys-devel/gcc:       4.4.5
sys-devel/gcc-config: 1.4.1
sys-devel/libtool:   2.2.10
sys-devel/make:      3.81-r2
virtual/os-headers:  2.6.36.1 (sys-kernel/linux-headers)
ACCEPT_KEYWORDS="x86"
ACCEPT_LICENSE="* -@EULA"
CBUILD="i686-pc-linux-gnu"
CFLAGS="-O2 -march=i686 -pipe"
CHOST="i686-pc-linux-gnu"
CONFIG_PROTECT="/etc /usr/share/config /usr/share/gnupg/qualified.txt"
CONFIG_PROTECT_MASK="/etc/ca-certificates.conf /etc/env.d /etc/fonts/fonts.conf /etc/gconf /etc/sandbox.d /etc/terminfo"
CXXFLAGS="-O2 -march=i686 -pipe"
DISTDIR="/usr/portage/distfiles"
FEATURES="assume-digests binpkg-logs distlocks fixlafiles fixpackages news parallel-fetch protect-owned sandbox sfperms strict unknown-features-warn unmerge-logs unmerge-orphans userfetch"
FFLAGS=""
GENTOO_MIRRORS="ftp://mirror.yandex.ru/gentoo-distfiles"
LANG="ru_RU.UTF-8"
LDFLAGS="-Wl,-O1 -Wl,--as-needed"
LINGUAS="ru en"
PKGDIR="/usr/portage/packages"
PORTAGE_CONFIGROOT="/"
PORTAGE_RSYNC_OPTS="--recursive --links --safe-links --perms --times --compress --force --whole-file --delete --stats --timeout=180 --exclude=/distfiles --exclude=/local --exclude=/packages"
PORTAGE_TMPDIR="/var/tmp"
PORTDIR="/usr/portage"
SYNC="rsync://rsync.gentoo.org/gentoo-portage"
USE="X acl alsa berkdb bzip2 cli cracklib crypt cups cxx dri fortran gdbm gpm iconv ipv6 modules mudflap ncurses nls nptl nptlonly openmp pam pcre perl pppd python readline session ssl sysfs tcpd unicode x86 xorg zlib" ALSA_CARDS="ali5451 als4000 atiixp atiixp-modem bt87x ca0106 cmipci emu10k1 emu10k1x ens1370 ens1371 es1938 es1968 fm801 hda-intel intel8x0 intel8x0m maestro3 trident usb-audio via82xx via82xx-modem ymfpci" ALSA_PCM_PLUGINS="adpcm alaw asym copy dmix dshare dsnoop empty extplug file hooks iec958 ioplug ladspa lfloat linear meter mmap_emul mulaw multi null plug rate route share shm softvol" APACHE2_MODULES="actions alias auth_basic authn_alias authn_anon authn_dbm authn_default authn_file authz_dbm authz_default authz_groupfile authz_host authz_owner authz_user autoindex cache cgi cgid dav dav_fs dav_lock deflate dir disk_cache env expires ext_filter file_cache filter headers include info log_config logio mem_cache mime mime_magic negotiation rewrite setenvif speling status unique_id userdir usertrack vhost_alias" CAMERAS="ptp2" COLLECTD_PLUGINS="df interface irq load memory rrdtool swap syslog" ELIBC="glibc" GPSD_PROTOCOLS="ashtech aivdm earthmate evermore fv18 garmin garmintxt gpsclock itrax mtk3301 nmea ntrip navcom oceanserver oldstyle oncore rtcm104v2 rtcm104v3 sirf superstar2 timing tsip tripmate tnt ubx" INPUT_DEVICES="keyboard mouse evdev" KERNEL="linux" LCD_DEVICES="bayrad cfontz cfontz633 glk hd44780 lb216 lcdm001 mtxorb ncurses text" LINGUAS="ru en" PHP_TARGETS="php5-3" RUBY_TARGETS="ruby18" USERLAND="GNU" VIDEO_CARDS="fbdev glint intel mach64 mga neomagic nouveau nv r128 radeon savage sis tdfx trident vesa via vmware dummy v4l" XTABLES_ADDONS="quota2 psd pknock lscan length2 ipv4options ipset ipp2p iface geoip fuzzy condition tee tarpit sysrq steal rawnat logmark ipmark dhcpmac delude chaos account" 
Unset:  CPPFLAGS, CTARGET, EMERGE_DEFAULT_OPTS, INSTALL_MASK, LC_ALL, MAKEOPTS, PORTAGE_BUNZIP2_COMMAND, PORTAGE_COMPRESS, PORTAGE_COMPRESS_FLAGS, PORTAGE_RSYNC_EXTRA_OPTS, PORTDIR_OVERLAY

uname -a

Linux Your-PC 2.6.36-gentoo-r8 #1 SMP Sat Apr 2 16:45:58 MSD 2011 i686 Pentium(R) Dual-Core CPU E6300 @ 2.80GHz GenuineIntel GNU/Linux

5

>.< Компьютер надомной издевается >.< Под chroot'ом в дебиане плазма поставилась >.<

6

В порядке оффтопа  wink
Почему вы не используете архитектуру amd64?

santic пишет:

ACCEPT_KEYWORDS="x86"

santic пишет:

System uname: Linux-2.6.36-gentoo-r8-i686-Pentium-R-_Dual-Core_CPU_E6300_@_2.80GHz-with-gentoo-1.12.14

...и в порядке общего бреда  wink
попробуйте чуть изменить /etc/make.conf

CFLAGS="-march=native -mtune=native -O2 -pipe"
Был, был и весь вышел...

7

>Почему вы не используете архитектуру amd64?

O_O как так?

>попробуйте чуть изменить /etc/make.conf

окей ab

8 (04.04.2011 14:54:36 отредактировано Lupo Alberto)

santic пишет:

O_O как так?

santic пишет:

System uname: Linux-2.6.36-gentoo-r8-i686-Pentium-R-_Dual-Core_CPU_E6300_@_2.80GHz-with-gentoo-1.12.14

Смотрите на предмет опции Instruction Set 64-bit
amd64 — общее название 64-битной архитектуры.

Был, был и весь вышел...

9

оу, я пропустил частицу "не" =) Эту архитектуру не использую, потому что у меня 1 gb RAM, вроде как имеет сысл использовать amd64 при RAM больше 2 гигов.

10

ah Снова расчудесные лаги со сборкой пакетов...терпения бы и мемтеста.

11

Попробуйте команду emerge запускать так:

 Консоль:

MAKEOPTS="-j1" emerge ...

santic пишет:

терпения бы и мемтеста.

А что мешает? На SystemRescueCD есть memtest  wink

Был, был и весь вышел...

12

Lupo Alberto пишет:
santic пишет:

терпения бы и мемтеста.

А что мешает? На SystemRescueCD есть memtest  wink

Попробую проще - поставлю мемтест и запихну чудом в grub =)

13

memtest86+ всё же выдал ошибки.

14 (05.04.2011 19:34:52 отредактировано White Nelud)

santic, вы проблему решили? А то я захотел попробовать кеды и у меня аналогичные ошибки (5 пакетов не встают).

15

Кеды поставил как-то =) плазму с 10 раза поставил...без питона....это минус, ибо виджеты новые не смогут встать. Большинство пакетов без проблем поставилось, были пакеты, которые с 2-3 раза собрались.

16

santic пишет:

memtest86+ всё же выдал ошибки.

Стоит заменить или хотя бы просто вытащить сбойную планку.

Йа тьомный эльф

17 (05.04.2011 21:12:26 отредактировано santic)

Стоит заменить или хотя бы просто вытащить сбойную планку.

Намутить планку для теста проблематично... Меня на данный момент насторожило то, что теперь мемтест не вываливает ошибки(3 прогона час заняли). Посему, на ночь поставлю мемтест. Это первое. Второе, множество пакетов всё еще не ставятся  ah  На всякий случай покажу make.conf:

# These settings were set by the catalyst build script that automatically
# built this stage.
# Please consult /usr/share/portage/config/make.conf.example for a more
# detailed example.
CFLAGS="-O2 -march=i686 -pipe"
#CFLAGS="-march=native -mtune=native -O2 -pipe"
CXXFLAGS="${CFLAGS}"
# WARNING: Changing your CHOST is not something that should be done lightly.
# Please consult http://www.gentoo.org/doc/en/change-chost.xml before changing.
CHOST="i686-pc-linux-gnu"
USE="-gnome -cdr -dvd X unicode alsa"
GENTOO_MIRRORS="ftp://mirror.yandex.ru/gentoo-distfiles"
LINGUAS="ru en"
#ACCEPT_LICENSE="*"

18

santic, собрать их с питоном не проблема. ИМХО.

19 (06.04.2011 19:58:54 отредактировано White Nelud)

Проблема так и не решилась (у меня). Пробовал обновлять sip - не помогло. Обновил Python (а вдруг) - тоже не помогло. Пробовал ставить с параметром --keep-going (да, я научился читать сообщения емерджа и читать маны  ag). Так же пробовал делать все манипуляции которые советовали на bugs.gentoo.org (та такой же баг был).

Вот --info:

+ открыть спойлер

Portage 2.1.9.42 (default/linux/amd64/10.0/desktop, gcc-4.4.5, glibc-2.11.3-r0, 2.6.36my x86_64)
=================================================================
System uname: Linux-2.6.36my-x86_64-Intel-R-_Core-TM-2_Duo_CPU_T6600_@_2.20GHz-with-gentoo-2.0.2
Timestamp of tree: Mon, 04 Apr 2011 15:15:01 +0000
app-shells/bash:     4.1_p9
dev-lang/python:     2.7.1-r1, 3.1.3-r1
dev-util/cmake:      2.8.4
sys-apps/baselayout: 2.0.2
sys-apps/openrc:     0.8.0
sys-apps/sandbox:    2.4
sys-devel/autoconf:  2.13, 2.65-r1
sys-devel/automake:  1.9.6-r3, 1.10.3, 1.11.1
sys-devel/binutils:  2.20.1-r1
sys-devel/gcc:       4.4.5
sys-devel/gcc-config: 1.4.1
sys-devel/libtool:   2.2.10
sys-devel/make:      3.81-r2
virtual/os-headers:  2.6.36.1 (sys-kernel/linux-headers)
ACCEPT_KEYWORDS="amd64"
ACCEPT_LICENSE="*"
CBUILD="x86_64-pc-linux-gnu"
CFLAGS="-O2 -pipe -march=core2"
CHOST="x86_64-pc-linux-gnu"
CONFIG_PROTECT="/etc /usr/share/config /usr/share/gnupg/qualified.txt"
CONFIG_PROTECT_MASK="/etc/ca-certificates.conf /etc/env.d /etc/fonts/fonts.conf /etc/gconf /etc/gentoo-release /etc/php/apache2-php5.3/ext-active/ /etc/php/cgi-php5.3/ext-active/ /etc/php/cli-php5.3/ext-active/ /etc/revdep-rebuild /etc/sandbox.d /etc/terminfo"
CXXFLAGS="-O2 -pipe -march=core2"
DISTDIR="/usr/portage/distfiles"
EMERGE_DEFAULT_OPTS="--with-bdeps=y --keep-going"
FEATURES="assume-digests binpkg-logs distlocks fixlafiles fixpackages news parallel-fetch protect-owned sandbox sfperms strict unknown-features-warn unmerge-logs unmerge-orphans userfetch"
FFLAGS=""
GENTOO_MIRRORS="http://mirror.yandex.ru/gentoo-distfiles"
LANG="ru_RU.UTF-8"
LC_ALL="ru_RU.UTF-8"
LDFLAGS="-Wl,-O1 -Wl,--as-needed"
LINGUAS="ru en"
MAKEOPTS="-j3"
PKGDIR="/usr/portage/packages"
PORTAGE_CONFIGROOT="/"
PORTAGE_RSYNC_OPTS="--recursive --links --safe-links --perms --times --compress --force --whole-file --delete --stats --timeout=180 --exclude=/distfiles --exclude=/local --exclude=/packages"
PORTAGE_TMPDIR="/var/tmp"
PORTDIR="/usr/portage"
PORTDIR_OVERLAY="/usr/local/portage"
SYNC="rsync://rsync.europe.gentoo.org/gentoo-portage"
USE="X a52 aac acl acpi alsa amd64 berkdb bluetooth branding bzip2 cairo cdr cli consolekit cracklib crypt cups cxx dbus dri dts dvd dvdr emboss encode exif extras fam firefox flac fortran gd gdbm gdu gif gnome gpm gtk iconv ipv6 jpeg kde lcms ldap libnotify mad mikmod mmx mng modules mp3 mp4 mpeg mudflap multilib ncurses nls nptl nptlonly nvidia ogg opengl openmp pam pango pcre pdf perl png policykit ppds pppd python qt3support qt4 qtk readline sdl session spell sse sse2 ssl startup-notification static-libs svg sysfs tcpd tiff truetype udev unicode usb vorbis x x264 xcb xml xorg xulrunner xv xvid zlib" ALSA_CARDS="ICH10" ALSA_PCM_PLUGINS="adpcm alaw asym copy dmix dshare dsnoop empty extplug file hooks iec958 ioplug ladspa lfloat linear meter mmap_emul mulaw multi null plug rate route share shm softvol" APACHE2_MODULES="actions alias auth_basic authn_alias authn_anon authn_dbm authn_default authn_file authz_dbm authz_default authz_groupfile authz_host authz_owner authz_user autoindex cache cgi cgid dav dav_fs dav_lock deflate dir disk_cache env expires ext_filter file_cache filter headers include info log_config logio mem_cache mime mime_magic negotiation rewrite setenvif speling status unique_id userdir usertrack vhost_alias" CAMERAS="ptp2" COLLECTD_PLUGINS="df interface irq load memory rrdtool swap syslog" ELIBC="glibc" GPSD_PROTOCOLS="ashtech aivdm earthmate evermore fv18 garmin garmintxt gpsclock itrax mtk3301 nmea ntrip navcom oceanserver oldstyle oncore rtcm104v2 rtcm104v3 sirf superstar2 timing tsip tripmate tnt ubx" INPUT_DEVICES="keyboard mouse evdev" KERNEL="linux" LCD_DEVICES="bayrad cfontz cfontz633 glk hd44780 lb216 lcdm001 mtxorb ncurses text" LINGUAS="ru en" PHP_TARGETS="php5-3" RUBY_TARGETS="ruby18" USERLAND="GNU" VIDEO_CARDS="nvidia" XTABLES_ADDONS="quota2 psd pknock lscan length2 ipv4options ipset ipp2p iface geoip fuzzy condition tee tarpit sysrq steal rawnat logmark ipmark dhcpmac delude chaos account"
Unset:  CPPFLAGS, CTARGET, INSTALL_MASK, PORTAGE_BUNZIP2_COMMAND, PORTAGE_COMPRESS, PORTAGE_COMPRESS_FLAGS, PORTAGE_RSYNC_EXTRA_OPTS

Ошибка при компиляции пакета pykde4:

+ открыть спойлер

make: *** [all] Ошибка 2
emake failed
* ERROR: kde-base/phonon-kde-4.4.5 failed (compile phase):
*   Make failed!
*
* Call stack:
*     ebuild.sh, line   56:  Called src_compile
*   environment, line 4180:  Called kde4-meta_src_compile
*   environment, line 3257:  Called kde4-base_src_compile
*   environment, line 2874:  Called cmake-utils_src_compile
*   environment, line 1199:  Called _execute_optionaly 'src_compile'
*   environment, line  582:  Called enable_cmake-utils_src_compile
*   environment, line 1454:  Called cmake-utils_src_make
*   environment, line 1218:  Called die
* The specific snippet of code:
*           emake "$@" || die "Make failed!";
*
* If you need support, post the output of 'emerge --info =kde-base/phonon-kde-4.4.5',
* the complete build log and the output of 'emerge -pqv =kde-base/phonon-kde-4.4.5'.
* The complete build log is located at '/var/tmp/portage/kde-base/phonon-kde-4.4.5/temp/build.log'.
* The ebuild environment file is located at '/var/tmp/portage/kde-base/phonon-kde-4.4.5/temp/environment'.
* S: '/var/tmp/portage/kde-base/phonon-kde-4.4.5/work/phonon-kde-4.4.5'

>>> Failed to emerge kde-base/phonon-kde-4.4.5, Log file:

>>>  '/var/tmp/portage/kde-base/phonon-kde-4.4.5/temp/build.log'

* Messages for package kde-base/pykde4-4.4.5-r1:

* ERROR: kde-base/pykde4-4.4.5-r1 failed (compile phase):
*   Make failed!
*
* Call stack:
*     ebuild.sh, line   56:  Called src_compile
*   environment, line 6500:  Called kde4-meta_src_compile
*   environment, line 3830:  Called kde4-base_src_compile
*   environment, line 3447:  Called cmake-utils_src_compile
*   environment, line 1772:  Called _execute_optionaly 'src_compile'
*   environment, line  726:  Called enable_cmake-utils_src_compile
*   environment, line 2027:  Called cmake-utils_src_make
*   environment, line 1791:  Called die
* The specific snippet of code:
*           emake "$@" || die "Make failed!";
*
* If you need support, post the output of 'emerge --info =kde-base/pykde4-4.4.5-r1',
* the complete build log and the output of 'emerge -pqv =kde-base/pykde4-4.4.5-r1'.
* The complete build log is located at '/var/tmp/portage/kde-base/pykde4-4.4.5-r1/temp/build.log'.
* The ebuild environment file is located at '/var/tmp/portage/kde-base/pykde4-4.4.5-r1/temp/environment'.
* S: '/var/tmp/portage/kde-base/pykde4-4.4.5-r1/work/pykde4-4.4.5'

* Messages for package kde-base/plasma-workspace-4.4.5:

* emerge --keep-going: kde-base/plasma-workspace-4.4.5 dropped due to
* unsatisfied dependency.

* Messages for package kde-base/kdeutils-meta-4.4.5:

* emerge --keep-going: kde-base/kdeutils-meta-4.4.5 dropped due to
* unsatisfied dependency.

* Messages for package kde-base/kdebase-meta-4.4.5:

* emerge --keep-going: kde-base/kdebase-meta-4.4.5 dropped due to unsatisfied
* dependency.

* Messages for package kde-base/kdeedu-meta-4.4.5:

* emerge --keep-going: kde-base/kdeedu-meta-4.4.5 dropped due to unsatisfied
* dependency.

* Messages for package kde-base/kde-meta-4.4.5:

* emerge --keep-going: kde-base/kde-meta-4.4.5 dropped due to unsatisfied
* dependency.

* Messages for package kde-base/kdebase-startkde-4.4.5:

* emerge --keep-going: kde-base/kdebase-startkde-4.4.5 dropped due to
* unsatisfied dependency.

* Messages for package kde-base/kdeplasma-addons-4.4.5:

* emerge --keep-going: kde-base/kdeplasma-addons-4.4.5 dropped due to
* unsatisfied dependency.

* Messages for package kde-base/marble-4.4.5:

* emerge --keep-going: kde-base/marble-4.4.5 dropped due to unsatisfied
* dependency.

* Messages for package kde-base/superkaramba-4.4.5:

* emerge --keep-going: kde-base/superkaramba-4.4.5 dropped due to unsatisfied
* dependency.

* Messages for package kde-base/mplayerthumbs-4.4.5:

* ERROR: kde-base/mplayerthumbs-4.4.5 failed (compile phase):
*   Make failed!
*
* Call stack:
*     ebuild.sh, line   56:  Called src_compile
*   environment, line 4173:  Called kde4-meta_src_compile
*   environment, line 3250:  Called kde4-base_src_compile
*   environment, line 2867:  Called cmake-utils_src_compile
*   environment, line 1192:  Called _execute_optionaly 'src_compile'
*   environment, line  575:  Called enable_cmake-utils_src_compile
*   environment, line 1447:  Called cmake-utils_src_make
*   environment, line 1211:  Called die
* The specific snippet of code:
*           emake "$@" || die "Make failed!";
*
* If you need support, post the output of 'emerge --info =kde-base/mplayerthumbs-4.4.5',
* the complete build log and the output of 'emerge -pqv =kde-base/mplayerthumbs-4.4.5'.
* The complete build log is located at '/var/tmp/portage/kde-base/mplayerthumbs-4.4.5/temp/build.log'.
* The ebuild environment file is located at '/var/tmp/portage/kde-base/mplayerthumbs-4.4.5/temp/environment'.
* S: '/var/tmp/portage/kde-base/mplayerthumbs-4.4.5/work/mplayerthumbs-4.4.5'

* Messages for package kde-base/kdemultimedia-meta-4.4.5:

* emerge --keep-going: kde-base/kdemultimedia-meta-4.4.5 dropped due to
* unsatisfied dependency.

* Messages for package kde-base/phonon-kde-4.4.5:

* ERROR: kde-base/phonon-kde-4.4.5 failed (compile phase):
*   Make failed!
*
* Call stack:
*     ebuild.sh, line   56:  Called src_compile
*   environment, line 4180:  Called kde4-meta_src_compile
*   environment, line 3257:  Called kde4-base_src_compile
*   environment, line 2874:  Called cmake-utils_src_compile
*   environment, line 1199:  Called _execute_optionaly 'src_compile'
*   environment, line  582:  Called enable_cmake-utils_src_compile
*   environment, line 1454:  Called cmake-utils_src_make
*   environment, line 1218:  Called die
* The specific snippet of code:
*           emake "$@" || die "Make failed!";
*
* If you need support, post the output of 'emerge --info =kde-base/phonon-kde-4.4.5',
* the complete build log and the output of 'emerge -pqv =kde-base/phonon-kde-4.4.5'.
* The complete build log is located at '/var/tmp/portage/kde-base/phonon-kde-4.4.5/temp/build.log'.
* The ebuild environment file is located at '/var/tmp/portage/kde-base/phonon-kde-4.4.5/temp/environment'.
* S: '/var/tmp/portage/kde-base/phonon-kde-4.4.5/work/phonon-kde-4.4.5'
*
* The following 13 packages have failed to build or install:
*
*  (kde-base/pykde4-4.4.5-r1, ebuild scheduled for merge), Log file:
*   '/var/tmp/portage/kde-base/pykde4-4.4.5-r1/temp/build.log'
*  (kde-base/plasma-workspace-4.4.5, ebuild scheduled for merge)
*  (kde-base/kdeutils-meta-4.4.5, ebuild scheduled for merge)
*  (kde-base/kdebase-meta-4.4.5, ebuild scheduled for merge)
*  (kde-base/kdeedu-meta-4.4.5, ebuild scheduled for merge)
*  (kde-base/kde-meta-4.4.5, ebuild scheduled for merge)
*  (kde-base/kdebase-startkde-4.4.5, ebuild scheduled for merge)
*  (kde-base/kdeplasma-addons-4.4.5, ebuild scheduled for merge)
*  (kde-base/marble-4.4.5, ebuild scheduled for merge)
*  (kde-base/superkaramba-4.4.5, ebuild scheduled for merge)
*  (kde-base/mplayerthumbs-4.4.5, ebuild scheduled for merge), Log file:
*   '/var/tmp/portage/kde-base/mplayerthumbs-4.4.5/temp/build.log'
*  (kde-base/kdemultimedia-meta-4.4.5, ebuild scheduled for merge)
*  (kde-base/phonon-kde-4.4.5, ebuild scheduled for merge), Log file:
*   '/var/tmp/portage/kde-base/phonon-kde-4.4.5/temp/build.log'
*

20

White Nelud пишет:

Ошибка при компиляции пакета pykde4:

Это только сообщение об ошибке, сама ошибка была в выводе команды до этого. Можно также посмотреть в

* The complete build log is located at '/var/tmp/portage/kde-base/phonon-kde-4.4.5/temp/build.log'.
Был, был и весь вышел...

21

Лог:

+ открыть спойлер

loading initial cache file /var/tmp/portage/kde-base/phonon-kde-4.4.5/temp/gentoo_common_config.cmake
-- The C compiler identification is GNU
-- The CXX compiler identification is GNU
-- Check for working C compiler: /usr/bin/x86_64-pc-linux-gnu-gcc
-- Check for working C compiler: /usr/bin/x86_64-pc-linux-gnu-gcc -- works
-- Detecting C compiler ABI info
-- Detecting C compiler ABI info - done
-- Check for working CXX compiler: /usr/bin/x86_64-pc-linux-gnu-g++
-- Check for working CXX compiler: /usr/bin/x86_64-pc-linux-gnu-g++ -- works
-- Detecting CXX compiler ABI info
-- Detecting CXX compiler ABI info - done
-- Looking for Q_WS_X11
-- Looking for Q_WS_X11 - found
-- Looking for Q_WS_WIN
-- Looking for Q_WS_WIN - not found.
-- Looking for Q_WS_QWS
-- Looking for Q_WS_QWS - not found.
-- Looking for Q_WS_MAC
-- Looking for Q_WS_MAC - not found.
-- Found Qt-Version 4.6.3 (using /usr/bin/qmake)
-- Looking for XOpenDisplay in /usr/lib64/libX11.so;/usr/lib64/libXext.so;/usr/lib64/libXft.so;/usr/lib64/libXau.so;/usr/lib64/libXdmcp.so;/usr/lib64/libXpm.so
-- Looking for XOpenDisplay in /usr/lib64/libX11.so;/usr/lib64/libXext.so;/usr/lib64/libXft.so;/usr/lib64/libXau.so;/usr/lib64/libXdmcp.so;/usr/lib64/libXpm.so - found
-- Looking for gethostbyname
-- Looking for gethostbyname - found
-- Looking for connect
-- Looking for connect - found
-- Looking for remove
-- Looking for remove - found
-- Looking for shmat
-- Looking for shmat - found
-- Looking for IceConnectionNumber in ICE
-- Looking for IceConnectionNumber in ICE - found
-- Found X11: /usr/lib64/libX11.so
-- Looking for include files CMAKE_HAVE_PTHREAD_H
-- Looking for include files CMAKE_HAVE_PTHREAD_H - found
-- Looking for pthread_create in pthreads
-- Looking for pthread_create in pthreads - not found
-- Looking for pthread_create in pthread
-- Looking for pthread_create in pthread - found
-- Found Threads: TRUE
-- Looking for _POSIX_TIMERS
-- Looking for _POSIX_TIMERS - found
-- Found Automoc4: /usr/bin/automoc4
-- Found Perl: /usr/bin/perl
CMake Warning (dev) at /usr/share/cmake/Modules/CheckCXXCompilerFlag.cmake:23 (INCLUDE):
  File /usr/share/cmake/Modules/CheckCXXCompilerFlag.cmake includes
  /usr/share/apps/cmake/modules/CheckCXXSourceCompiles.cmake (found via
  CMAKE_MODULE_PATH) which shadows
  /usr/share/cmake/Modules/CheckCXXSourceCompiles.cmake.  This may cause
  errors later on .

  Policy CMP0017 is not set: Prefer files from the CMake module directory
  when including from there.  Run "cmake --help-policy CMP0017" for policy
  details.  Use the cmake_policy command to set the policy and suppress this
  warning.
Call Stack (most recent call first):
  /usr/share/apps/cmake/modules/FindKDE4Internal.cmake:406 (include)
  /usr/share/cmake/Modules/FindKDE4.cmake:95 (FIND_PACKAGE)
  CMakeLists.txt:8 (find_package)
This warning is for project developers.  Use -Wno-dev to suppress it.

-- Phonon Version: 4.4.2
-- Found Phonon: /usr/lib64/libphonon.so
-- Found Phonon Includes: /usr/include/KDE;/usr/include
-- Performing Test _OFFT_IS_64BIT
-- Performing Test _OFFT_IS_64BIT - Success
-- Performing Test HAVE_FPIE_SUPPORT
-- Performing Test HAVE_FPIE_SUPPORT - Success
-- Performing Test __KDE_HAVE_W_OVERLOADED_VIRTUAL
-- Performing Test __KDE_HAVE_W_OVERLOADED_VIRTUAL - Success
-- Performing Test __KDE_HAVE_GCC_VISIBILITY
-- Performing Test __KDE_HAVE_GCC_VISIBILITY - Success
-- Found KDE 4.4 include dir: /usr/include
-- Found KDE 4.4 library dir: /usr/lib64
-- Found the KDE4 kconfig_compiler preprocessor: /usr/bin/kconfig_compiler
-- Found automoc4: /usr/bin/automoc4
-- Strigi API needs 'signed char'
-- Found Strigi: /usr/lib64/libstreams.so
-- Found Soprano: /usr/include
-- Could NOT find SharedDesktopOntologies (missing:  SHAREDDESKTOPONTOLOGIES_ROOT_DIR)
-- Could NOT find Nepomuk (missing:  NEPOMUK_LIBRARIES NEPOMUK_INCLUDE_DIR SHAREDDESKTOPONTOLOGIES_FOUND)
-- Found SLP: /usr/lib64/libslp.so
-- Found libattica: /usr/lib64/libattica.so
-- Looking for include files HAVE_SYS_WAIT_H
-- Looking for include files HAVE_SYS_WAIT_H - found
-- Looking for include files HAVE_SYS_TIME_H
-- Looking for include files HAVE_SYS_TIME_H - found
-- Looking for snd_seq_create_simple_port in asound
-- Looking for snd_seq_create_simple_port in asound - found
-- Found ALSA: /usr/lib64/libasound.so
-- Looking for include files HAVE_SYS_SOUNDCARD_H
-- Looking for include files HAVE_SYS_SOUNDCARD_H - found
-- Looking for include files HAVE_MACHINE_SOUNDCARD_H
-- Looking for include files HAVE_MACHINE_SOUNDCARD_H - not found.
-- Looking for include files HAVE_LINUX_AWE_VOICE_H
-- Looking for include files HAVE_LINUX_AWE_VOICE_H - not found.
-- Looking for include files HAVE_AWE_VOICE_H
-- Looking for include files HAVE_AWE_VOICE_H - not found.
-- Looking for include files HAVE__USR_SRC_SYS_I386_ISA_SOUND_AWE_VOICE_H
-- Looking for include files HAVE__USR_SRC_SYS_I386_ISA_SOUND_AWE_VOICE_H - not found.
-- Looking for include files HAVE__USR_SRC_SYS_GNU_I386_ISA_SOUND_AWE_VOICE_H
-- Looking for include files HAVE__USR_SRC_SYS_GNU_I386_ISA_SOUND_AWE_VOICE_H - not found.
-- Looking for C++ include sys/asoundlib.h
-- Looking for C++ include sys/asoundlib.h - found
-- Looking for C++ include alsa/asoundlib.h
-- Looking for C++ include alsa/asoundlib.h - found
-- Looking for snd_pcm_resume in asound
-- Looking for snd_pcm_resume in asound - found
--   found libxine, version 1.1.19
-- Performing Test XINE_XCB_FOUND
-- Performing Test XINE_XCB_FOUND - Success
-- Found Xine: /usr/include

-----------------------------------------------------------------------------
-- The following external packages were located on your system.
-- This installation will have the extra features provided by these packages.
-----------------------------------------------------------------------------
   * Soprano - Semantic Desktop Storing
   * Soprano Virtuoso Backend - Virtuoso storage backend for Soprano
   * Soprano Raptor Parser - RDF parser plugin for Soprano
   * Soprano Redland Backend - Redland storage backend for Soprano
   * OpenSLP - SLP (Service Location Protocol) implementation
   * libattica - A library to access Open Collaboration Service providers
   * Phonon - Phonon library
   * ALSA - The Advanced Linux Sound Architecture (ALSA) library
   * Xine - Xine libraries

-----------------------------------------------------------------------------
-- The following OPTIONAL packages could NOT be located on your system.
-- Consider installing them to enable more features from this software.
-----------------------------------------------------------------------------
   * Shared desktop ontologies  <http://oscaf.sourceforge.net>
     Desktop ontologies
     Ontologies necessary for the Nepomuk semantic desktop.
   * Nepomuk  <kdelibs>
     Nepomuk Libraries
     Required to build Nepomuk.

-----------------------------------------------------------------------------

-- <<< Gentoo configuration >>>
Build type      Gentoo
Install path    /usr
Compiler flags:
C               -O2 -pipe -march=core2  -Wno-long-long -std=iso9899:1990 -Wundef -Wcast-align -Werror-implicit-function-declaration -Wchar-subscripts -Wall -W -Wpointer-arith -Wwrite-strings -Wformat-security -Wmissing-format-attribute -fno-common
C++             -O2 -pipe -march=core2  -Wnon-virtual-dtor -Wno-long-long -ansi -Wundef -Wcast-align -Wchar-subscripts -Wall -W -Wpointer-arith -Wformat-security -fno-exceptions -DQT_NO_EXCEPTIONS -fno-check-new -fno-common -Woverloaded-virtual -fno-threadsafe-statics -fvisibility=hidden -fvisibility-inlines-hidden
Linker flags:
Executable      -Wl,--enable-new-dtags -Wl,-O1 -Wl,--as-needed
Module          -Wl,--enable-new-dtags -Wl,--fatal-warnings -Wl,--no-undefined -lc -Wl,-O1 -Wl,--as-needed
Shared          -Wl,--enable-new-dtags -Wl,--fatal-warnings -Wl,--no-undefined -lc -Wl,-O1 -Wl,--as-needed

-- Configuring done
CMake Warning at /usr/share/apps/cmake/modules/KDE4Macros.cmake:626 (add_library):
  Cannot generate a safe linker search path for target kded_phononserver
  because files in some directories may conflict with libraries in implicit
  directories:

    link library [libphonon.so] in /usr/lib64 may be hidden by files in:
      /usr/lib64/qt4

  Some of these libraries may not be found correctly.
Call Stack (most recent call first):
  phonon/kded-module/CMakeLists.txt:8 (kde4_add_plugin)


CMake Warning at /usr/share/apps/cmake/modules/KDE4Macros.cmake:626 (add_library):
  Cannot generate a safe runtime search path for target kded_phononserver
  because files in some directories may conflict with libraries in implicit
  directories:

    runtime library [libphonon.so.4] in /usr/lib64 may be hidden by files in:
      /usr/lib64/qt4

  Some of these libraries may not be found correctly.
Call Stack (most recent call first):
  phonon/kded-module/CMakeLists.txt:8 (kde4_add_plugin)


CMake Warning at /usr/share/apps/cmake/modules/KDE4Macros.cmake:626 (add_library):
  Cannot generate a safe linker search path for target kde because files in
  some directories may conflict with libraries in implicit directories:

    link library [libphonon.so] in /usr/lib64 may be hidden by files in:
      /usr/lib64/qt4

  Some of these libraries may not be found correctly.
Call Stack (most recent call first):
  phonon/platform_kde/CMakeLists.txt:13 (kde4_add_plugin)


CMake Warning at /usr/share/apps/cmake/modules/KDE4Macros.cmake:626 (add_library):
  Cannot generate a safe runtime search path for target kde because files in
  some directories may conflict with libraries in implicit directories:

    runtime library [libphonon.so.4] in /usr/lib64 may be hidden by files in:
      /usr/lib64/qt4

  Some of these libraries may not be found correctly.
Call Stack (most recent call first):
  phonon/platform_kde/CMakeLists.txt:13 (kde4_add_plugin)


CMake Warning at /usr/share/apps/cmake/modules/KDE4Macros.cmake:626 (add_library):
  Cannot generate a safe linker search path for target kcm_phonon because
  files in some directories may conflict with libraries in implicit
  directories:

    link library [libphonon.so] in /usr/lib64 may be hidden by files in:
      /usr/lib64/qt4

  Some of these libraries may not be found correctly.
Call Stack (most recent call first):
  phonon/kcm/CMakeLists.txt:6 (kde4_add_plugin)


CMake Warning at /usr/share/apps/cmake/modules/KDE4Macros.cmake:626 (add_library):
  Cannot generate a safe runtime search path for target kcm_phonon because
  files in some directories may conflict with libraries in implicit
  directories:

    runtime library [libphonon.so.4] in /usr/lib64 may be hidden by files in:
      /usr/lib64/qt4

  Some of these libraries may not be found correctly.
Call Stack (most recent call first):
  phonon/kcm/CMakeLists.txt:6 (kde4_add_plugin)


-- Generating done
-- Build files have been written to: /var/tmp/portage/kde-base/phonon-kde-4.4.5/work/phonon-kde-4.4.5_build
>>> Source configured.
>>> Compiling source in /var/tmp/portage/kde-base/phonon-kde-4.4.5/work/phonon-kde-4.4.5 ...
>>> Working in BUILD_DIR: "/var/tmp/portage/kde-base/phonon-kde-4.4.5/work/phonon-kde-4.4.5_build"
make -j3
-- Found Qt-Version 4.6.3 (using /usr/bin/qmake)
-- Found X11: /usr/lib64/libX11.so
CMake Warning (dev) at /usr/share/cmake/Modules/CheckCXXCompilerFlag.cmake:23 (INCLUDE):
  File /usr/share/cmake/Modules/CheckCXXCompilerFlag.cmake includes
  /usr/share/apps/cmake/modules/CheckCXXSourceCompiles.cmake (found via
  CMAKE_MODULE_PATH) which shadows
  /usr/share/cmake/Modules/CheckCXXSourceCompiles.cmake.  This may cause
  errors later on .

  Policy CMP0017 is not set: Prefer files from the CMake module directory
  when including from there.  Run "cmake --help-policy CMP0017" for policy
  details.  Use the cmake_policy command to set the policy and suppress this
  warning.
Call Stack (most recent call first):
  /usr/share/apps/cmake/modules/FindKDE4Internal.cmake:406 (include)
  /usr/share/cmake/Modules/FindKDE4.cmake:95 (FIND_PACKAGE)
  CMakeLists.txt:8 (find_package)
This warning is for project developers.  Use -Wno-dev to suppress it.

-- Phonon Version: 4.4.2
-- Found KDE 4.4 include dir: /usr/include
-- Found KDE 4.4 library dir: /usr/lib64
-- Found the KDE4 kconfig_compiler preprocessor: /usr/bin/kconfig_compiler
-- Found automoc4: /usr/bin/automoc4
-- Strigi API needs 'signed char'
-- Could NOT find SharedDesktopOntologies (missing:  SHAREDDESKTOPONTOLOGIES_ROOT_DIR)
-- Could NOT find Nepomuk (missing:  NEPOMUK_LIBRARIES NEPOMUK_INCLUDE_DIR SHAREDDESKTOPONTOLOGIES_FOUND)
-- Found ALSA: /usr/lib64/libasound.so

-----------------------------------------------------------------------------
-- The following external packages were located on your system.
-- This installation will have the extra features provided by these packages.
-----------------------------------------------------------------------------
   * Soprano - Semantic Desktop Storing
   * Soprano Virtuoso Backend - Virtuoso storage backend for Soprano
   * Soprano Raptor Parser - RDF parser plugin for Soprano
   * Soprano Redland Backend - Redland storage backend for Soprano
   * OpenSLP - SLP (Service Location Protocol) implementation
   * libattica - A library to access Open Collaboration Service providers
   * Phonon - Phonon library
   * ALSA - The Advanced Linux Sound Architecture (ALSA) library
   * Xine - Xine libraries

-----------------------------------------------------------------------------
-- The following OPTIONAL packages could NOT be located on your system.
-- Consider installing them to enable more features from this software.
-----------------------------------------------------------------------------
   * Shared desktop ontologies  <http://oscaf.sourceforge.net>
     Desktop ontologies
     Ontologies necessary for the Nepomuk semantic desktop.
   * Nepomuk  <kdelibs>
     Nepomuk Libraries
     Required to build Nepomuk.

-----------------------------------------------------------------------------

-- <<< Gentoo configuration >>>
Build type      Gentoo
Install path    /usr
Compiler flags:
C               -O2 -pipe -march=core2  -Wno-long-long -std=iso9899:1990 -Wundef -Wcast-align -Werror-implicit-function-declaration -Wchar-subscripts -Wall -W -Wpointer-arith -Wwrite-strings -Wformat-security -Wmissing-format-attribute -fno-common
C++             -O2 -pipe -march=core2  -Wnon-virtual-dtor -Wno-long-long -ansi -Wundef -Wcast-align -Wchar-subscripts -Wall -W -Wpointer-arith -Wformat-security -fno-exceptions -DQT_NO_EXCEPTIONS -fno-check-new -fno-common -Woverloaded-virtual -fno-threadsafe-statics -fvisibility=hidden -fvisibility-inlines-hidden
Linker flags:
Executable      -Wl,--enable-new-dtags -Wl,-O1 -Wl,--as-needed
Module          -Wl,--enable-new-dtags -Wl,--fatal-warnings -Wl,--no-undefined -lc -Wl,-O1 -Wl,--as-needed
Shared          -Wl,--enable-new-dtags -Wl,--fatal-warnings -Wl,--no-undefined -lc -Wl,-O1 -Wl,--as-needed

-- Configuring done
CMake Warning at /usr/share/apps/cmake/modules/KDE4Macros.cmake:626 (add_library):
  Cannot generate a safe linker search path for target kded_phononserver
  because files in some directories may conflict with libraries in implicit
  directories:

    link library [libphonon.so] in /usr/lib64 may be hidden by files in:
      /usr/lib64/qt4

  Some of these libraries may not be found correctly.
Call Stack (most recent call first):
  phonon/kded-module/CMakeLists.txt:8 (kde4_add_plugin)


CMake Warning at /usr/share/apps/cmake/modules/KDE4Macros.cmake:626 (add_library):
  Cannot generate a safe runtime search path for target kded_phononserver
  because files in some directories may conflict with libraries in implicit
  directories:

    runtime library [libphonon.so.4] in /usr/lib64 may be hidden by files in:
      /usr/lib64/qt4

  Some of these libraries may not be found correctly.
Call Stack (most recent call first):
  phonon/kded-module/CMakeLists.txt:8 (kde4_add_plugin)


CMake Warning at /usr/share/apps/cmake/modules/KDE4Macros.cmake:626 (add_library):
  Cannot generate a safe linker search path for target kde because files in
  some directories may conflict with libraries in implicit directories:

    link library [libphonon.so] in /usr/lib64 may be hidden by files in:
      /usr/lib64/qt4

  Some of these libraries may not be found correctly.
Call Stack (most recent call first):
  phonon/platform_kde/CMakeLists.txt:13 (kde4_add_plugin)


CMake Warning at /usr/share/apps/cmake/modules/KDE4Macros.cmake:626 (add_library):
  Cannot generate a safe runtime search path for target kde because files in
  some directories may conflict with libraries in implicit directories:

    runtime library [libphonon.so.4] in /usr/lib64 may be hidden by files in:
      /usr/lib64/qt4

  Some of these libraries may not be found correctly.
Call Stack (most recent call first):
  phonon/platform_kde/CMakeLists.txt:13 (kde4_add_plugin)


CMake Warning at /usr/share/apps/cmake/modules/KDE4Macros.cmake:626 (add_library):
  Cannot generate a safe linker search path for target kcm_phonon because
  files in some directories may conflict with libraries in implicit
  directories:

    link library [libphonon.so] in /usr/lib64 may be hidden by files in:
      /usr/lib64/qt4

  Some of these libraries may not be found correctly.
Call Stack (most recent call first):
  phonon/kcm/CMakeLists.txt:6 (kde4_add_plugin)


CMake Warning at /usr/share/apps/cmake/modules/KDE4Macros.cmake:626 (add_library):
  Cannot generate a safe runtime search path for target kcm_phonon because
  files in some directories may conflict with libraries in implicit
  directories:

    runtime library [libphonon.so.4] in /usr/lib64 may be hidden by files in:
      /usr/lib64/qt4

  Some of these libraries may not be found correctly.
Call Stack (most recent call first):
  phonon/kcm/CMakeLists.txt:6 (kde4_add_plugin)


-- Generating done
-- Build files have been written to: /var/tmp/portage/kde-base/phonon-kde-4.4.5/work/phonon-kde-4.4.5_build
Scanning dependencies of target kde_automoc
Scanning dependencies of target kcm_phonon_automoc
Scanning dependencies of target kded_phononserver_automoc
Generating kdeplatformplugin.moc
Generating main.moc
Generating moc_phononserver.cpp
Generating moc_devicepreference.cpp
Generating kiomediastream.moc
[  0%] Built target kded_phononserver_automoc
Scanning dependencies of target phonon_devicepreference_update_automoc
[  0%] Built target phonon_devicepreference_update_automoc
Scanning dependencies of target phonon_deviceuids_update_automoc
[  0%] Built target phonon_deviceuids_update_automoc
Generating moc_devicelisting.cpp
Scanning dependencies of target kcm_phononxine_automoc
Generating backendselection.moc
Generating xineoptions.moc
[  0%] Built target kde_automoc
Scanning dependencies of target kded_phononserver
[  0%] Built target kcm_phonon_automoc
[  4%] Generating qrc_resources.cxx
[  4%] Built target kcm_phononxine_automoc
[  8%] Generating ui_backendselection.h
Scanning dependencies of target kde
[ 12%] Generating ui_devicepreference.h
Scanning dependencies of target kcm_phonon
[ 16%] Building CXX object phonon/kded-module/CMakeFiles/kded_phononserver.dir/kded_phononserver_automoc.o
[ 20%] Building CXX object phonon/platform_kde/CMakeFiles/kde.dir/kde_automoc.o
[ 25%] Building CXX object phonon/kcm/CMakeFiles/kcm_phonon.dir/kcm_phonon_automoc.o
[ 29%] Building CXX object phonon/kcm/CMakeFiles/kcm_phonon.dir/main.o
[ 33%] [ 37%] Building CXX object phonon/platform_kde/CMakeFiles/kde.dir/kdeplatformplugin.o
Building CXX object phonon/kded-module/CMakeFiles/kded_phononserver.dir/phononserver.o
[ 41%] Building CXX object phonon/kcm/CMakeFiles/kcm_phonon.dir/devicepreference.o
[ 45%] Building CXX object phonon/platform_kde/CMakeFiles/kde.dir/kiomediastream.o
[ 50%] Building CXX object phonon/platform_kde/CMakeFiles/kde.dir/devicelisting.o
[ 54%] Building CXX object phonon/kded-module/CMakeFiles/kded_phononserver.dir/audiodevice.o
[ 58%] Building CXX object phonon/platform_kde/CMakeFiles/kde.dir/qrc_resources.o
Linking CXX shared module ../../lib/kde.so
[ 62%] Building CXX object phonon/kded-module/CMakeFiles/kded_phononserver.dir/audiodeviceaccess.o
[ 62%] Built target kde
Scanning dependencies of target phonon_devicepreference_update
[ 66%] Building CXX object phonon/kcm/CMakeFiles/phonon_devicepreference_update.dir/phonon_devicepreference_update_automoc.o
[ 75%] [ 75%] Building CXX object phonon/kded-module/CMakeFiles/kded_phononserver.dir/hardwaredatabase.o
Building CXX object phonon/kcm/CMakeFiles/phonon_devicepreference_update.dir/devicepreference_update.o
[ 79%] Building CXX object phonon/kcm/CMakeFiles/kcm_phonon.dir/backendselection.o
Linking CXX executable phonon_devicepreference_update
[ 79%] Built target phonon_devicepreference_update
Scanning dependencies of target phonon_deviceuids_update
[ 83%] Building CXX object phonon/kcm/CMakeFiles/phonon_deviceuids_update.dir/phonon_deviceuids_update_automoc.o
[ 87%] Building CXX object phonon/kcm/CMakeFiles/phonon_deviceuids_update.dir/deviceuids_update.o
Linking CXX shared module ../../lib/kded_phononserver.so
[ 87%] Built target kded_phononserver
[ 91%] Generating ui_xineoptions.h
Scanning dependencies of target kcm_phononxine
[ 95%] Building CXX object phonon/kcm/xine/CMakeFiles/kcm_phononxine.dir/kcm_phononxine_automoc.o
[100%] Building CXX object phonon/kcm/xine/CMakeFiles/kcm_phononxine.dir/xineoptions.o
Linking CXX shared module ../../lib/kcm_phonon.so
Linking CXX executable phonon_deviceuids_update
[100%] Built target phonon_deviceuids_update
CMakeFiles/kcm_phonon.dir/devicepreference.o: In function `DevicePreference::save()':
devicepreference.cpp:(.text+0x774): undefined reference to `Phonon::GlobalConfig::setAudioOutputDeviceListFor(Phonon::Category, QList<int>)'
devicepreference.cpp:(.text+0x897): undefined reference to `Phonon::GlobalConfig::setAudioCaptureDeviceListFor(Phonon::Category, QList<int>)'
CMakeFiles/kcm_phonon.dir/devicepreference.o: In function `DevicePreference::on_showCheckBox_toggled()':
devicepreference.cpp:(.text+0x1db6): undefined reference to `Phonon::GlobalConfig::setHideAdvancedDevices(bool)'
CMakeFiles/kcm_phonon.dir/devicepreference.o: In function `DevicePreference::load()':
devicepreference.cpp:(.text+0x1dfd): undefined reference to `Phonon::GlobalConfig::hideAdvancedDevices() const'
collect2: выполнение ld завершилось с кодом возврата 1
make[2]: *** [lib/kcm_phonon.so] Ошибка 1
make[1]: *** [phonon/kcm/CMakeFiles/kcm_phonon.dir/all] Ошибка 2
make[1]: *** Ожидание завершения заданий...
Linking CXX shared module ../../../lib/kcm_phononxine.so
[100%] Built target kcm_phononxine
make: *** [all] Ошибка 2
emake failed
* ERROR: kde-base/phonon-kde-4.4.5 failed (compile phase):
*   Make failed!
*
* Call stack:
*     ebuild.sh, line   56:  Called src_compile
*   environment, line 4180:  Called kde4-meta_src_compile
*   environment, line 3257:  Called kde4-base_src_compile
*   environment, line 2874:  Called cmake-utils_src_compile
*   environment, line 1199:  Called _execute_optionaly 'src_compile'
*   environment, line  582:  Called enable_cmake-utils_src_compile
*   environment, line 1454:  Called cmake-utils_src_make
*   environment, line 1218:  Called die
* The specific snippet of code:
*           emake "$@" || die "Make failed!";
*
* If you need support, post the output of 'emerge --info =kde-base/phonon-kde-4.4.5',
* the complete build log and the output of 'emerge -pqv =kde-base/phonon-kde-4.4.5'.
* The complete build log is located at '/var/tmp/portage/kde-base/phonon-kde-4.4.5/temp/build.log'.
* The ebuild environment file is located at '/var/tmp/portage/kde-base/phonon-kde-4.4.5/temp/environment'.
* S: '/var/tmp/portage/kde-base/phonon-kde-4.4.5/work/phonon-kde-4.4.5'