31 (18.11.2011 11:52:03 отредактировано redux)

Otten пишет:

Т.е. перейдя например на тестинг, можно сразу столкнуться с кучей косяков? Чего можно ожидать? Ведь есть пользователи, что и на анстэйбле постоянно. Всегда сталкивался с тем, что новый софт иногда требует того, что есть в тестинге, но нет у меня, и надо доставлять оттуда. Например вчера потребовалось новое libnss3-1d, и оно только в тестинге. Так может сразу на тестинг?

Нет, нет, мы говорили немного о других материях. Понятие "косяки" тут не совсем подходит.
На дебиане-тестинге многие живут годами, переходя с одного на следующий.
Помните, что Ubuntu делается вообще из сида.

Конечно можно сразу на дебиан-тестинг на десктопе.
Если попадется баг,- можете поучаствовать в допиливании: напишите баг-репорт,- пообщаетесь с разрабами,- посмотрите как исправят. Правда, репорты сообществом делаются очень оперативно и не так-то просто заметить баг, который еще не залит на трекер.Хотя можно, конечно.

С другой стороны, можете дождаться когда тестинг заморозят,- то есть перестанут менять состав пакетной базы,- набор пакетов, а будут только исправлять имеющиеся пакеты. Тестинг в таком состоянии уже ближе к стэйблу.

Но помните, тесниг- есть тестинг, в принципе может быть что угодно.

С третьей стороны, как тут уже писали, - многое зависти от радиуса кривизны рук. У кого-то тестинг поёт и пляшет, а иной будет жаловаться на стейбл или вообще олдстейбл.

32

Otten пишет:

Т.е. перейдя например на тестинг, можно сразу столкнуться с кучей косяков? Чего можно ожидать?

не первый год на тестинге. На "косяк" натолкнулся только один раз: когда Ленни был тестингом там сменилось ядро. А для этого ядра не было родных дров для карточки ATI 1200Xpress. Поставил свободные. Компиз стал глючить (заголовки окон пропадали). Какоето время сидел без графических эффектов (но, лично мне, это совершенно не критично). Потом поправили.  (Т.е. даже если бы я просто переходил на новый релиз, пришлось бы менять дрова, только вот не видел пропадающих шапок)
Вот на на этой неделе читал что в тестинге в хромиуме какойто косяк вылез (сам не проверял, т.к. у меня хром не из репы).

В общем то вот и все за два с гаком года на тестинге. На компе и работа и развлечение.....  (Так же тестинг на походном ноутбуке и у жены на фирме ставил)

Имхо все зависит от целей и задач. Если новизна программ совершенно не критична то оставайтесь на стабильной. (например до тех пор пока количество незакрытых багов будет в ней меньше http://bugs.debian.org/release-critical/) если все же хочется посвежее - для десктопа вполне годная ветка.

То что не убивает нас, делает нас сильнее! © Ницше.
When life puts you in tough situations, don’t say "why me". Just say "try me".
GNU/Linux Debian

33

Помните, что Ubuntu делается вообще из сида.

Из тестинга. Оффиц. инфа.

34

В моей истории всего один критичный "косяк" с тестингом,- дело было на сквизе-тестинге, aptoncd при запуске падал. И долго ничего не приходило в обновах. Как то я подумал, может всем пофиг этот пакет, залил багрепорт. Но это была моя наивность, репорт уже дано был и я просто продублировал, не разобравшись. Майнтайнер ответил еще на первый репорт, что исправления давно есть и скоро зальет.
Может быть у меня потребности такие скромные, но более "косяков" мешавших мне лично не припомню.

35 (18.11.2011 12:41:34 отредактировано redux)

metra пишет:

Из тестинга. Оффиц. инфа.

Я рьяно спорить не буду, Но вот википедия пишет

Пакеты Ubuntu в основном базируются на пакетах из нестабильной (unstable) группы пакетов Debian.

Взято здесь:
http://ru.wikipedia.org/wiki/Ubuntu
Вот тут то же на английском:

Ubuntu packages are based on packages from Debian's unstable branch

http://en.wikipedia.org/wiki/Ubuntu_(operating_system)

Опять же unstable это sid просто по названию:
In the Debian jargon, unstable is the development distribution of Debian. It is codenamed sid.
С той же вики:
http://en.wikipedia.org/wiki/Unstable_(Debian)

36

Otten пишет:

Так может сразу на тестинг?

Сначала backports, сторонние репы, изучить продвинутые возможности управления пакетами, наконец самому научиться бекпортировать небольшие пакеты, и если все это не позволит установить нужную версию без радикального обновления - тогда да, ничего не поделаешь, к сожалению бывает зависимости не позволяют использовать то что хочешь, таков стиль разработки.

Если у вас не получается разговаривать снисходительным тоном, найдите пользователя Unix, он покажет, как это делается. Скотт Адамс

37

metra
Из Testing только LTS-релизы.

38

Darth Revan, redux, точно, перепутал.

39 (18.11.2011 18:05:21 отредактировано Otten)

Скачал сорцы cairo-1.10.2 , пропатчило без ошибок, зато теперь не собирается.

root@debian:/home/otten/Загрузки/libcairo2_1.10.2/cairo-1.10.2# dpkg-buildpackage
dpkg-buildpackage: экспорт CFLAGS из dpkg-buildflags (происхождение: vendor): -g -O2
dpkg-buildpackage: экспорт CPPFLAGS из dpkg-buildflags (происхождение: vendor): 
dpkg-buildpackage: экспорт CXXFLAGS из dpkg-buildflags (происхождение: vendor): -g -O2
dpkg-buildpackage: экспорт FFLAGS из dpkg-buildflags (происхождение: vendor): -g -O2
dpkg-buildpackage: экспорт LDFLAGS из dpkg-buildflags (происхождение: vendor): 
tail: невозможно открыть «debian/changelog» для чтения: Нет такого файла или каталога
dpkg-buildpackage: ошибка: конец debian/changelog возвратил код ошибки 1
root@debian:/home/otten/Загрузки/libcairo2_1.10.2/cairo-1.10.2# 

В папке с исходниками нет почему-то папки Debian с содержимым, в предыдущей версии 1.8.10 была..

Сделал в каталоге исходников по рекомендациям вики:

./configure --prefix=/usr && make

Потом dh_make, а оно мне - команда не найдена.

P.S.  Хех, ну я и тормоз, папка Debian, во втором скачаном архиве.


P.P.S  Пакеты собрались, поставил. Результат удовлетворительный, для меня по крайней мере.
В рутовых окнах и в хроме тоже теперь все нормально, но в хроме похуже, чем в iceweasel. Cairo брал из тестинга, патч отсюда http://aur.archlinux.org/packages.php?ID=8110

40

Otten,
mkdir -p ~/constructor/{cairo,patch}
cd ~/constructor/patch
wget -c http://www.sergeysl.ru/wp-content/uploa … type.patch
cd ../cairo
sudo apt-get -y install dpkg-dev devscripts fakeroot
apt-get source cairo
cd cairo*
dch -i  #называем например 1.10.2-6-hinting
cd .. #архив *.orig.tar.gz переименовать, будет видно различие
cd cairo*
patch -Np1 -i ../../patch/cairo*
apt-get build-dep cairo
dpkg-buildpackage -rfakeroot
cd ..
sudo dpkg -i libcairo2_1*
Примерно так.

Если у вас не получается разговаривать снисходительным тоном, найдите пользователя Unix, он покажет, как это делается. Скотт Адамс

41 (18.11.2011 18:27:48 отредактировано Otten)

Ну, так оно и было. Только у меня не sudo.

Скрины, кому интересно.
Все равно что-то местами не так. Например с цифрами 6, 8, 9..

http://savepic.su/753629.htm
http://savepic.su/777180.htm

42

Otten, чет не похоже что пропатчено, вот мой:

http://savepic.su/786385m.png

Если у вас не получается разговаривать снисходительным тоном, найдите пользователя Unix, он покажет, как это делается. Скотт Адамс

43

Действительно..
А fonts.conf можно посмотреть, и какие где еще настройки проставлены?

44

То, что менялось то я заметил это точно. По сравнению с изкоробочной версией так на голову лучше.

45

http://savepic.su/743376m.png

<?xml version='1.0'?>
<!DOCTYPE fontconfig SYSTEM 'fonts.dtd'>
<fontconfig>
 <match target="font">
  <edit mode="assign" name="rgba">
   <const>rgb</const>
  </edit>
 </match>
 <match target="font">
  <edit mode="assign" name="hinting">
   <bool>true</bool>
  </edit>
 </match>
 <match target="font">
  <edit mode="assign" name="hintstyle">
   <const>hintslight</const>
  </edit>
 </match>
 <match target="font">
  <edit mode="assign" name="antialias">
   <bool>true</bool>
  </edit>
 </match>
</fontconfig>
Если у вас не получается разговаривать снисходительным тоном, найдите пользователя Unix, он покажет, как это делается. Скотт Адамс

46

http://storage6.static.itmages.ru/i/11/1118/h_1321627891_6524465_1365a4a906.png

+ открыть спойлер
<?xml version="1.0"?>
<!DOCTYPE fontconfig SYSTEM "fonts.dtd">
<fontconfig>
    <match target="font">
        <edit name="antialias" mode="assign"><bool>true</bool></edit>
        <edit name="autohint" mode="assign"><bool>false</bool></edit>
        <edit name="hintstyle" mode="assign"><const>hintfull</const></edit>
        <edit name="hinting" mode="assign"><bool>true</bool></edit>
        <edit name="rgba" mode="assign"><const>rgb</const></edit>
    <!-- lcdnone, lcddefault, lcdlight, lcdlegacy -->
    <edit name="lcdfilter" mode="assign"><const>lcddefault</const></edit>
    </match>

    <match target="font">
    <test name="size" compare="less_eq"><double>8</double></test>
        <edit name="autohint" mode="assign"><bool>true</bool></edit>
    </match>
    <match target="font">
    <test name="size" compare="more_eq"><double>14</double></test>
    <edit name="rgba" mode="assign"><const>none</const></edit>
    </match>

    <match target="font">
        <test name="family"><string>Tahoma</string></test>
        <test name="size" compare="eq"><double>6</double></test>
        <test name="weight" compare="more_eq"><const>medium</const></test>
        <edit name="autohint" mode="assign"><bool>true</bool></edit>
    </match>
    <!-- Replace Clean font with sans-serif -->
    <match target="pattern" name="family" >
        <test name="family" qual="any" >
            <string>Clean</string>
        </test>
        <edit mode="assign" name="family" >
            <string>sans-serif</string>
        </edit>
    </match>
    <!-- Replace Fixed font with monospace -->
    <match target="pattern" name="family" >
        <test name="family" qual="any" >
            <string>Fixed</string>
        </test>
        <edit mode="assign" name="family" >
            <string>monospace</string>
        </edit>
    </match>
    <!-- Replace Nimbus family font with default -->
    <match target="pattern" name="family" >
        <test name="family" qual="any" >
            <string>Nimbus Sans L</string>
        </test>
        <edit mode="assign" name="family" >
            <string>sans-serif</string>
        </edit>
    </match>
    <match target="pattern" name="family" >
        <test name="family" qual="any" >
            <string>Nimbus Roman No9 L</string>
        </test>
        <edit mode="assign" name="family" >
            <string>serif</string>
        </edit>
    </match>
    <match target="pattern" name="family" >
        <test name="family" qual="any" >
            <string>Nimbus Mono L</string>
        </test>
        <edit mode="assign" name="family" >
            <string>monospace</string>
        </edit>
    </match>

    <!-- Set default font -->
    <alias>
        <family>Droid Serif</family>
        <default><family>serif</family></default>
    </alias>

    <alias>
        <family>Droid Sans</family>
        <default><family>sans-serif</family></default>
    </alias>

    <alias>
        <family>Liberation Mono</family>
        <default><family>monospace</family></default>
    </alias>

    <alias>
        <family>serif</family>
        <prefer><family>Droid Serif</family></prefer>
    </alias>
    <alias>
        <family>sans-serif</family>
        <prefer><family>Droid Sans</family></prefer>
    </alias>
    <alias>
        <family>monospace</family>
        <prefer><family>Liberation Mono</family></prefer>
    </alias>
</fontconfig>

47

Ну да, все правильно, выходит это всё автохинтер. У меня остался включен с предыдущих экспериментов.
Вырубил автохинтер, все чуточку поменялось. А хром снова стал коробкой  ag

48

Пытаюсь пересобрать пакет cairo по посту №40, но на шаге dpkg-buildpackage -rfakeroot выдает ошибку:

+ открыть спойлер

dpkg-buildpackage: архитектура узла i386
dpkg-source --before-build cairo-1.10.2-6
fakeroot debian/rules clean
dh_testdir
dh_testroot
[ ! -r src/cairo-features.h.orig ] || mv -f src/cairo-features.h.orig src/cairo-features.h
[ ! -r configure-common-stamp ] || patch -NRp1 < debian/ltmain_as-needed.patch
rm -f *-stamp
rm -rf /home/abulychev/constructor/cairo/cairo-1.10.2-6/debian/build /home/abulychev/constructor/cairo/cairo-1.10.2-6/debian/install
dh_autoreconf_clean
dh_clean
dpkg-source -b cairo-1.10.2-6
dpkg-source: инфо: используется формат исходника «3.0 (quilt)»
dpkg-source: инфо: сборка cairo с использованием существующего ./cairo_1.10.2-6.orig.tar.gz
dpkg-source: инфо: local changes detected, the modified files are:
cairo-1.10.2-6/src/cairo-ft-font.c
dpkg-source: инфо: you can integrate the local changes with dpkg-source --commit
dpkg-source: ошибка: aborting due to unexpected upstream changes, see /tmp/cairo_1.10.2-6-hinting.diff.cL087S
dpkg-buildpackage: ошибка: dpkg-source -b cairo-1.10.2-6 возвратил код ошибки 2

Пробовал гуглить данную ошибку, внятного ответа не нашел((

49

дак пакеты есть уже собранные - http://linuxforum.ru/viewtopic.php?pid=224254#p224254

50

metra пишет:

дак пакеты есть уже собранные - http://linuxforum.ru/viewtopic.php?pid=224254#p224254

Да, но у меня sid. Проблем при установке не будет?

51

ABulychev, сделай так,  и если не пойдет тогда вывод сюда.
wget -c http://www.sergeysl.ru/wp-content/uploa … type.patch
sudo apt-get -y install dpkg-dev devscripts fakeroot
apt-get source cairo
cd cairo*
patch -Np1 -i ../cairo-9999-cleartype.patch
apt-get build-dep cairo
dpkg-buildpackage -rfakeroot
cd ..
sudo dpkg -i libcairo2_*

Если у вас не получается разговаривать снисходительным тоном, найдите пользователя Unix, он покажет, как это делается. Скотт Адамс

52

papin-aziat, выхлоп после dpkg-buildpackage -rfakeroot :

+ открыть спойлер

dpkg-buildpackage: предупреждение: используется команда получения прав root, но уже есть права root
dpkg-buildpackage: пакет исходных текстов cairo
dpkg-buildpackage: версия исходных текстов 1.10.2-6.1
dpkg-buildpackage: исходные тексты изменены Aurelien Jarno <aurel32@debian.org>
dpkg-buildpackage: архитектура узла i386
dpkg-source --before-build cairo-1.10.2
fakeroot debian/rules clean
dh_testdir
dh_testroot
[ ! -r src/cairo-features.h.orig ] || mv -f src/cairo-features.h.orig src/cairo-features.h
[ ! -r configure-common-stamp ] || patch -NRp1 < debian/ltmain_as-needed.patch
rm -f *-stamp
rm -rf /home/abulychev/constructor/cairo-1.10.2/debian/build /home/abulychev/constructor/cairo-1.10.2/debian/install
dh_autoreconf_clean
dh_clean
dpkg-source -b cairo-1.10.2
dpkg-source: инфо: используется формат исходника «3.0 (quilt)»
dpkg-source: инфо: сборка cairo с использованием существующего ./cairo_1.10.2.orig.tar.gz
dpkg-source: инфо: local changes detected, the modified files are:
cairo-1.10.2/src/cairo-ft-font.c
dpkg-source: инфо: you can integrate the local changes with dpkg-source --commit
dpkg-source: ошибка: aborting due to unexpected upstream changes, see /tmp/cairo_1.10.2-6.1.diff.kbS_j3
dpkg-buildpackage: ошибка: dpkg-source -b cairo-1.10.2 возвратил код ошибки 2

53

ABulychev, а все остальные шаги без проблем? Все делал с нуля в чистом каталоге?

ABulychev пишет:

dpkg-buildpackage: предупреждение: используется команда получения прав root, но уже есть права root

Сборка идет от рута тогда -rfakeroot не надо.

Если у вас не получается разговаривать снисходительным тоном, найдите пользователя Unix, он покажет, как это делается. Скотт Адамс

54

papin-aziat пишет:

ABulychev, а все остальные шаги без проблем? Все делал с нуля в чистом каталоге?

Все предыдущие команды выполнялись без ошибок.Несколько раз делал с нуля и в новых каталогах.

papin-aziat пишет:

Сборка идет от рута тогда -rfakeroot не надо.

Это понял. Просто пробовал как от рута, так и от об.пользователя.

55

ABulychev, ну тогда я бы собрал разок без патча, потом с патчем и станет ясно кто виноват :-).

Если у вас не получается разговаривать снисходительным тоном, найдите пользователя Unix, он покажет, как это делается. Скотт Адамс

56

papin-aziat, похоже и без патча собираться не хочет. Вывод dpkg-buildpackage -rfakeroot:

 Консоль:

configure.ac:646: the top level
test/Makefile.am:1735: `%'-style pattern rules are a GNU make extension
test/Makefile.am:1736: <: non-POSIX variable name
build/Makefile.am.changelog:57: `%'-style pattern rules are a GNU make extension
Makefile.am:80:   `build/Makefile.am.changelog' included from here
patch -Np1 < debian/ltmain_as-needed.patch
patching file build/ltmain.sh
Hunk #1 succeeded at 5800 (offset 1084 lines).
Hunk #2 FAILED at 5075.
1 out of 2 hunks FAILED -- saving rejects to file build/ltmain.sh.rej
make: *** [configure-common-stamp] Ошибка 1
dpkg-buildpackage: ошибка: debian/rules build возвратил код ошибки 2

Полностью вывод:

+ открыть спойлер

dpkg-buildpackage: пакет исходных текстов cairo
dpkg-buildpackage: версия исходных текстов 1.10.2-6.1
dpkg-buildpackage: исходные тексты изменены Aurelien Jarno <aurel32@debian.org>
dpkg-buildpackage: архитектура узла i386
dpkg-source --before-build cairo-1.10.2
fakeroot debian/rules clean
dh_testdir
dh_testroot
[ ! -r src/cairo-features.h.orig ] || mv -f src/cairo-features.h.orig src/cairo-features.h
[ ! -r configure-common-stamp ] || patch -NRp1 < debian/ltmain_as-needed.patch
rm -f *-stamp
rm -rf /home/abulychev/constructor/cairo-1.10.2/debian/build /home/abulychev/constructor/cairo-1.10.2/debian/install
dh_autoreconf_clean
dh_clean
dpkg-source -b cairo-1.10.2
dpkg-source: инфо: используется формат исходника «3.0 (quilt)»
dpkg-source: инфо: сборка cairo с использованием существующего ./cairo_1.10.2.orig.tar.gz
dpkg-source: инфо: сборка cairo в cairo_1.10.2-6.1.debian.tar.gz
dpkg-source: инфо: сборка cairo в cairo_1.10.2-6.1.dsc
debian/rules build
dh_testdir
# Generated by configure and breaks the build if already existing
test -r src/cairo-features.h && \
      mv src/cairo-features.h src/cairo-features.h.orig
make: [configure-common-stamp] Ошибка 1 (игнорирована)
dh_autoreconf
configure.ac:16: warning: AC_LANG_CONFTEST: no AC_LANG_SOURCE call detected in body
../../lib/autoconf/lang.m4:194: AC_LANG_CONFTEST is expanded from...
../../lib/autoconf/general.m4:2662: _AC_LINK_IFELSE is expanded from...
../../lib/autoconf/general.m4:2679: AC_LINK_IFELSE is expanded from...
build/libtool.m4:1022: _LT_SYS_MODULE_PATH_AIX is expanded from...
build/libtool.m4:4170: _LT_LINKER_SHLIBS is expanded from...
build/libtool.m4:5253: _LT_LANG_C_CONFIG is expanded from...
build/libtool.m4:138: _LT_SETUP is expanded from...
build/libtool.m4:67: LT_INIT is expanded from...
build/libtool.m4:102: AC_PROG_LIBTOOL is expanded from...
configure.ac:16: the top level
configure.ac:16: warning: AC_LANG_CONFTEST: no AC_LANG_SOURCE call detected in body
../../lib/autoconf/lang.m4:194: AC_LANG_CONFTEST is expanded from...
../../lib/autoconf/general.m4:2662: _AC_LINK_IFELSE is expanded from...
../../lib/autoconf/general.m4:2679: AC_LINK_IFELSE is expanded from...
build/libtool.m4:4170: _LT_LINKER_SHLIBS is expanded from...
build/libtool.m4:5253: _LT_LANG_C_CONFIG is expanded from...
build/libtool.m4:138: _LT_SETUP is expanded from...
build/libtool.m4:67: LT_INIT is expanded from...
build/libtool.m4:102: AC_PROG_LIBTOOL is expanded from...
configure.ac:16: the top level
build/configure.ac.tools:7: warning: AC_LANG_CONFTEST: no AC_LANG_SOURCE call detected in body
../../lib/autoconf/lang.m4:194: AC_LANG_CONFTEST is expanded from...
../../lib/autoconf/general.m4:2662: _AC_LINK_IFELSE is expanded from...
../../lib/autoconf/general.m4:2679: AC_LINK_IFELSE is expanded from...
build/libtool.m4:1022: _LT_SYS_MODULE_PATH_AIX is expanded from...
build/libtool.m4:5360: _LT_LANG_CXX_CONFIG is expanded from...
build/libtool.m4:785: _LT_LANG is expanded from...
build/libtool.m4:768: LT_LANG is expanded from...
build/configure.ac.tools:7: the top level
build/configure.ac.warnings:39: warning: AC_LANG_CONFTEST: no AC_LANG_SOURCE call detected in body
../../lib/autoconf/lang.m4:194: AC_LANG_CONFTEST is expanded from...
../../lib/autoconf/general.m4:2662: _AC_LINK_IFELSE is expanded from...
../../lib/autoconf/general.m4:2679: AC_LINK_IFELSE is expanded from...
build/aclocal.cairo.m4:89: CAIRO_CC_TRY_LINK_WITH_ENV_SILENT is expanded from...
build/aclocal.cairo.m4:124: CAIRO_CC_TRY_FLAG_SILENT is expanded from...
build/aclocal.cairo.m4:131: CAIRO_CC_CHECK_WERROR is expanded from...
build/aclocal.cairo.m4:148: CAIRO_CC_TRY_FLAG is expanded from...
../../lib/m4sugar/m4sh.m4:606: AS_IF is expanded from...
../../lib/autoconf/general.m4:2032: AC_CACHE_VAL is expanded from...
../../lib/autoconf/general.m4:2053: AC_CACHE_CHECK is expanded from...
build/configure.ac.warnings:39: the top level
build/configure.ac.warnings:39: warning: AC_LANG_CONFTEST: no AC_LANG_SOURCE call detected in body
../../lib/autoconf/lang.m4:194: AC_LANG_CONFTEST is expanded from...
../../lib/autoconf/general.m4:2662: _AC_LINK_IFELSE is expanded from...
../../lib/autoconf/general.m4:2679: AC_LINK_IFELSE is expanded from...
build/aclocal.cairo.m4:89: CAIRO_CC_TRY_LINK_WITH_ENV_SILENT is expanded from...
build/aclocal.cairo.m4:124: CAIRO_CC_TRY_FLAG_SILENT is expanded from...
build/aclocal.cairo.m4:148: CAIRO_CC_TRY_FLAG is expanded from...
../../lib/m4sugar/m4sh.m4:606: AS_IF is expanded from...
../../lib/autoconf/general.m4:2032: AC_CACHE_VAL is expanded from...
../../lib/autoconf/general.m4:2053: AC_CACHE_CHECK is expanded from...
build/configure.ac.warnings:39: the top level
build/configure.ac.warnings:69: warning: AC_LANG_CONFTEST: no AC_LANG_SOURCE call detected in body
../../lib/autoconf/lang.m4:194: AC_LANG_CONFTEST is expanded from...
../../lib/autoconf/general.m4:2662: _AC_LINK_IFELSE is expanded from...
../../lib/autoconf/general.m4:2679: AC_LINK_IFELSE is expanded from...
build/aclocal.cairo.m4:89: CAIRO_CC_TRY_LINK_WITH_ENV_SILENT is expanded from...
build/aclocal.cairo.m4:124: CAIRO_CC_TRY_FLAG_SILENT is expanded from...
../../lib/m4sugar/m4sh.m4:606: AS_IF is expanded from...
../../lib/autoconf/general.m4:2032: AC_CACHE_VAL is expanded from...
../../lib/autoconf/general.m4:2053: AC_CACHE_CHECK is expanded from...
build/configure.ac.warnings:69: the top level
build/configure.ac.warnings:83: warning: AC_LANG_CONFTEST: no AC_LANG_SOURCE call detected in body
../../lib/autoconf/lang.m4:194: AC_LANG_CONFTEST is expanded from...
../../lib/autoconf/general.m4:2662: _AC_LINK_IFELSE is expanded from...
../../lib/autoconf/general.m4:2679: AC_LINK_IFELSE is expanded from...
build/aclocal.cairo.m4:89: CAIRO_CC_TRY_LINK_WITH_ENV_SILENT is expanded from...
build/aclocal.cairo.m4:124: CAIRO_CC_TRY_FLAG_SILENT is expanded from...
build/aclocal.cairo.m4:131: CAIRO_CC_CHECK_WERROR is expanded from...
build/aclocal.cairo.m4:148: CAIRO_CC_TRY_FLAG is expanded from...
../../lib/m4sugar/m4sh.m4:606: AS_IF is expanded from...
../../lib/autoconf/general.m4:2032: AC_CACHE_VAL is expanded from...
../../lib/autoconf/general.m4:2053: AC_CACHE_CHECK is expanded from...
build/configure.ac.warnings:83: the top level
build/configure.ac.warnings:83: warning: AC_LANG_CONFTEST: no AC_LANG_SOURCE call detected in body
../../lib/autoconf/lang.m4:194: AC_LANG_CONFTEST is expanded from...
../../lib/autoconf/general.m4:2662: _AC_LINK_IFELSE is expanded from...
../../lib/autoconf/general.m4:2679: AC_LINK_IFELSE is expanded from...
build/aclocal.cairo.m4:89: CAIRO_CC_TRY_LINK_WITH_ENV_SILENT is expanded from...
build/aclocal.cairo.m4:124: CAIRO_CC_TRY_FLAG_SILENT is expanded from...
build/aclocal.cairo.m4:148: CAIRO_CC_TRY_FLAG is expanded from...
../../lib/m4sugar/m4sh.m4:606: AS_IF is expanded from...
../../lib/autoconf/general.m4:2032: AC_CACHE_VAL is expanded from...
../../lib/autoconf/general.m4:2053: AC_CACHE_CHECK is expanded from...
build/configure.ac.warnings:83: the top level
build/configure.ac.analysis:75: warning: AC_LANG_CONFTEST: no AC_LANG_SOURCE call detected in body
../../lib/autoconf/lang.m4:194: AC_LANG_CONFTEST is expanded from...
../../lib/autoconf/general.m4:2662: _AC_LINK_IFELSE is expanded from...
../../lib/autoconf/general.m4:2679: AC_LINK_IFELSE is expanded from...
build/aclocal.cairo.m4:89: CAIRO_CC_TRY_LINK_WITH_ENV_SILENT is expanded from...
build/aclocal.cairo.m4:124: CAIRO_CC_TRY_FLAG_SILENT is expanded from...
build/aclocal.cairo.m4:131: CAIRO_CC_CHECK_WERROR is expanded from...
build/aclocal.cairo.m4:148: CAIRO_CC_TRY_FLAG is expanded from...
build/configure.ac.analysis:75: the top level
build/configure.ac.analysis:75: warning: AC_LANG_CONFTEST: no AC_LANG_SOURCE call detected in body
../../lib/autoconf/lang.m4:194: AC_LANG_CONFTEST is expanded from...
../../lib/autoconf/general.m4:2662: _AC_LINK_IFELSE is expanded from...
../../lib/autoconf/general.m4:2679: AC_LINK_IFELSE is expanded from...
build/aclocal.cairo.m4:89: CAIRO_CC_TRY_LINK_WITH_ENV_SILENT is expanded from...
build/aclocal.cairo.m4:124: CAIRO_CC_TRY_FLAG_SILENT is expanded from...
build/aclocal.cairo.m4:148: CAIRO_CC_TRY_FLAG is expanded from...
build/configure.ac.analysis:75: the top level
configure.ac:646: warning: AC_LANG_CONFTEST: no AC_LANG_SOURCE call detected in body
../../lib/autoconf/lang.m4:194: AC_LANG_CONFTEST is expanded from...
../../lib/autoconf/general.m4:2662: _AC_LINK_IFELSE is expanded from...
../../lib/autoconf/general.m4:2679: AC_LINK_IFELSE is expanded from...
build/aclocal.cairo.m4:89: CAIRO_CC_TRY_LINK_WITH_ENV_SILENT is expanded from...
build/configure.ac.pthread:136: CAIRO_CHECK_PTHREAD is expanded from...
build/configure.ac.pthread:189: CAIRO_CONFIGURE_PTHREAD is expanded from...
../../lib/m4sugar/m4sh.m4:606: AS_IF is expanded from...
../../lib/autoconf/general.m4:2032: AC_CACHE_VAL is expanded from...
../../lib/autoconf/general.m4:2053: AC_CACHE_CHECK is expanded from...
../../lib/m4sugar/m4sh.m4:517: AS_CASE is expanded from...
build/aclocal.enable.m4:41: _CAIRO_ENABLE is expanded from...
build/configure.ac.features:23: CAIRO_ENABLE is expanded from...
configure.ac:646: the top level
configure.ac:16: warning: AC_LANG_CONFTEST: no AC_LANG_SOURCE call detected in body
../../lib/autoconf/lang.m4:194: AC_LANG_CONFTEST is expanded from...
../../lib/autoconf/general.m4:2662: _AC_LINK_IFELSE is expanded from...
../../lib/autoconf/general.m4:2679: AC_LINK_IFELSE is expanded from...
build/libtool.m4:1022: _LT_SYS_MODULE_PATH_AIX is expanded from...
build/libtool.m4:4170: _LT_LINKER_SHLIBS is expanded from...
build/libtool.m4:5253: _LT_LANG_C_CONFIG is expanded from...
build/libtool.m4:138: _LT_SETUP is expanded from...
build/libtool.m4:67: LT_INIT is expanded from...
build/libtool.m4:102: AC_PROG_LIBTOOL is expanded from...
configure.ac:16: the top level
configure.ac:16: warning: AC_LANG_CONFTEST: no AC_LANG_SOURCE call detected in body
../../lib/autoconf/lang.m4:194: AC_LANG_CONFTEST is expanded from...
../../lib/autoconf/general.m4:2662: _AC_LINK_IFELSE is expanded from...
../../lib/autoconf/general.m4:2679: AC_LINK_IFELSE is expanded from...
build/libtool.m4:4170: _LT_LINKER_SHLIBS is expanded from...
build/libtool.m4:5253: _LT_LANG_C_CONFIG is expanded from...
build/libtool.m4:138: _LT_SETUP is expanded from...
build/libtool.m4:67: LT_INIT is expanded from...
build/libtool.m4:102: AC_PROG_LIBTOOL is expanded from...
configure.ac:16: the top level
build/configure.ac.tools:7: warning: AC_LANG_CONFTEST: no AC_LANG_SOURCE call detected in body
../../lib/autoconf/lang.m4:194: AC_LANG_CONFTEST is expanded from...
../../lib/autoconf/general.m4:2662: _AC_LINK_IFELSE is expanded from...
../../lib/autoconf/general.m4:2679: AC_LINK_IFELSE is expanded from...
build/libtool.m4:1022: _LT_SYS_MODULE_PATH_AIX is expanded from...
build/libtool.m4:5360: _LT_LANG_CXX_CONFIG is expanded from...
build/libtool.m4:785: _LT_LANG is expanded from...
build/libtool.m4:768: LT_LANG is expanded from...
build/configure.ac.tools:7: the top level
build/configure.ac.warnings:39: warning: AC_LANG_CONFTEST: no AC_LANG_SOURCE call detected in body
../../lib/autoconf/lang.m4:194: AC_LANG_CONFTEST is expanded from...
../../lib/autoconf/general.m4:2662: _AC_LINK_IFELSE is expanded from...
../../lib/autoconf/general.m4:2679: AC_LINK_IFELSE is expanded from...
build/aclocal.cairo.m4:89: CAIRO_CC_TRY_LINK_WITH_ENV_SILENT is expanded from...
build/aclocal.cairo.m4:124: CAIRO_CC_TRY_FLAG_SILENT is expanded from...
build/aclocal.cairo.m4:131: CAIRO_CC_CHECK_WERROR is expanded from...
build/aclocal.cairo.m4:148: CAIRO_CC_TRY_FLAG is expanded from...
../../lib/m4sugar/m4sh.m4:606: AS_IF is expanded from...
../../lib/autoconf/general.m4:2032: AC_CACHE_VAL is expanded from...
../../lib/autoconf/general.m4:2053: AC_CACHE_CHECK is expanded from...
build/configure.ac.warnings:39: the top level
build/configure.ac.warnings:39: warning: AC_LANG_CONFTEST: no AC_LANG_SOURCE call detected in body
../../lib/autoconf/lang.m4:194: AC_LANG_CONFTEST is expanded from...
../../lib/autoconf/general.m4:2662: _AC_LINK_IFELSE is expanded from...
../../lib/autoconf/general.m4:2679: AC_LINK_IFELSE is expanded from...
build/aclocal.cairo.m4:89: CAIRO_CC_TRY_LINK_WITH_ENV_SILENT is expanded from...
build/aclocal.cairo.m4:124: CAIRO_CC_TRY_FLAG_SILENT is expanded from...
build/aclocal.cairo.m4:148: CAIRO_CC_TRY_FLAG is expanded from...
../../lib/m4sugar/m4sh.m4:606: AS_IF is expanded from...
../../lib/autoconf/general.m4:2032: AC_CACHE_VAL is expanded from...
../../lib/autoconf/general.m4:2053: AC_CACHE_CHECK is expanded from...
build/configure.ac.warnings:39: the top level
build/configure.ac.warnings:69: warning: AC_LANG_CONFTEST: no AC_LANG_SOURCE call detected in body
../../lib/autoconf/lang.m4:194: AC_LANG_CONFTEST is expanded from...
../../lib/autoconf/general.m4:2662: _AC_LINK_IFELSE is expanded from...
../../lib/autoconf/general.m4:2679: AC_LINK_IFELSE is expanded from...
build/aclocal.cairo.m4:89: CAIRO_CC_TRY_LINK_WITH_ENV_SILENT is expanded from...
build/aclocal.cairo.m4:124: CAIRO_CC_TRY_FLAG_SILENT is expanded from...
../../lib/m4sugar/m4sh.m4:606: AS_IF is expanded from...
../../lib/autoconf/general.m4:2032: AC_CACHE_VAL is expanded from...
../../lib/autoconf/general.m4:2053: AC_CACHE_CHECK is expanded from...
build/configure.ac.warnings:69: the top level
build/configure.ac.warnings:83: warning: AC_LANG_CONFTEST: no AC_LANG_SOURCE call detected in body
../../lib/autoconf/lang.m4:194: AC_LANG_CONFTEST is expanded from...
../../lib/autoconf/general.m4:2662: _AC_LINK_IFELSE is expanded from...
../../lib/autoconf/general.m4:2679: AC_LINK_IFELSE is expanded from...
build/aclocal.cairo.m4:89: CAIRO_CC_TRY_LINK_WITH_ENV_SILENT is expanded from...
build/aclocal.cairo.m4:124: CAIRO_CC_TRY_FLAG_SILENT is expanded from...
build/aclocal.cairo.m4:131: CAIRO_CC_CHECK_WERROR is expanded from...
build/aclocal.cairo.m4:148: CAIRO_CC_TRY_FLAG is expanded from...
../../lib/m4sugar/m4sh.m4:606: AS_IF is expanded from...
../../lib/autoconf/general.m4:2032: AC_CACHE_VAL is expanded from...
../../lib/autoconf/general.m4:2053: AC_CACHE_CHECK is expanded from...
build/configure.ac.warnings:83: the top level
build/configure.ac.warnings:83: warning: AC_LANG_CONFTEST: no AC_LANG_SOURCE call detected in body
../../lib/autoconf/lang.m4:194: AC_LANG_CONFTEST is expanded from...
../../lib/autoconf/general.m4:2662: _AC_LINK_IFELSE is expanded from...
../../lib/autoconf/general.m4:2679: AC_LINK_IFELSE is expanded from...
build/aclocal.cairo.m4:89: CAIRO_CC_TRY_LINK_WITH_ENV_SILENT is expanded from...
build/aclocal.cairo.m4:124: CAIRO_CC_TRY_FLAG_SILENT is expanded from...
build/aclocal.cairo.m4:148: CAIRO_CC_TRY_FLAG is expanded from...
../../lib/m4sugar/m4sh.m4:606: AS_IF is expanded from...
../../lib/autoconf/general.m4:2032: AC_CACHE_VAL is expanded from...
../../lib/autoconf/general.m4:2053: AC_CACHE_CHECK is expanded from...
build/configure.ac.warnings:83: the top level
build/configure.ac.analysis:75: warning: AC_LANG_CONFTEST: no AC_LANG_SOURCE call detected in body
../../lib/autoconf/lang.m4:194: AC_LANG_CONFTEST is expanded from...
../../lib/autoconf/general.m4:2662: _AC_LINK_IFELSE is expanded from...
../../lib/autoconf/general.m4:2679: AC_LINK_IFELSE is expanded from...
build/aclocal.cairo.m4:89: CAIRO_CC_TRY_LINK_WITH_ENV_SILENT is expanded from...
build/aclocal.cairo.m4:124: CAIRO_CC_TRY_FLAG_SILENT is expanded from...
build/aclocal.cairo.m4:131: CAIRO_CC_CHECK_WERROR is expanded from...
build/aclocal.cairo.m4:148: CAIRO_CC_TRY_FLAG is expanded from...
build/configure.ac.analysis:75: the top level
build/configure.ac.analysis:75: warning: AC_LANG_CONFTEST: no AC_LANG_SOURCE call detected in body
../../lib/autoconf/lang.m4:194: AC_LANG_CONFTEST is expanded from...
../../lib/autoconf/general.m4:2662: _AC_LINK_IFELSE is expanded from...
../../lib/autoconf/general.m4:2679: AC_LINK_IFELSE is expanded from...
build/aclocal.cairo.m4:89: CAIRO_CC_TRY_LINK_WITH_ENV_SILENT is expanded from...
build/aclocal.cairo.m4:124: CAIRO_CC_TRY_FLAG_SILENT is expanded from...
build/aclocal.cairo.m4:148: CAIRO_CC_TRY_FLAG is expanded from...
build/configure.ac.analysis:75: the top level
configure.ac:646: warning: AC_LANG_CONFTEST: no AC_LANG_SOURCE call detected in body
../../lib/autoconf/lang.m4:194: AC_LANG_CONFTEST is expanded from...
../../lib/autoconf/general.m4:2662: _AC_LINK_IFELSE is expanded from...
../../lib/autoconf/general.m4:2679: AC_LINK_IFELSE is expanded from...
build/aclocal.cairo.m4:89: CAIRO_CC_TRY_LINK_WITH_ENV_SILENT is expanded from...
build/configure.ac.pthread:136: CAIRO_CHECK_PTHREAD is expanded from...
build/configure.ac.pthread:189: CAIRO_CONFIGURE_PTHREAD is expanded from...
../../lib/m4sugar/m4sh.m4:606: AS_IF is expanded from...
../../lib/autoconf/general.m4:2032: AC_CACHE_VAL is expanded from...
../../lib/autoconf/general.m4:2053: AC_CACHE_CHECK is expanded from...
../../lib/m4sugar/m4sh.m4:517: AS_CASE is expanded from...
build/aclocal.enable.m4:41: _CAIRO_ENABLE is expanded from...
build/configure.ac.features:23: CAIRO_ENABLE is expanded from...
configure.ac:646: the top level
libtoolize: putting auxiliary files in AC_CONFIG_AUX_DIR, `build'.
libtoolize: copying file `build/ltmain.sh'
libtoolize: putting macros in AC_CONFIG_MACRO_DIR, `build'.
libtoolize: copying file `build/libtool.m4'
libtoolize: copying file `build/ltoptions.m4'
libtoolize: copying file `build/ltsugar.m4'
libtoolize: copying file `build/ltversion.m4'
libtoolize: copying file `build/lt~obsolete.m4'
build/configure.ac.warnings:39: warning: AC_LANG_CONFTEST: no AC_LANG_SOURCE call detected in body
../../lib/autoconf/lang.m4:194: AC_LANG_CONFTEST is expanded from...
../../lib/autoconf/general.m4:2662: _AC_LINK_IFELSE is expanded from...
../../lib/autoconf/general.m4:2679: AC_LINK_IFELSE is expanded from...
build/aclocal.cairo.m4:89: CAIRO_CC_TRY_LINK_WITH_ENV_SILENT is expanded from...
build/aclocal.cairo.m4:124: CAIRO_CC_TRY_FLAG_SILENT is expanded from...
build/aclocal.cairo.m4:131: CAIRO_CC_CHECK_WERROR is expanded from...
build/aclocal.cairo.m4:148: CAIRO_CC_TRY_FLAG is expanded from...
../../lib/m4sugar/m4sh.m4:606: AS_IF is expanded from...
../../lib/autoconf/general.m4:2032: AC_CACHE_VAL is expanded from...
../../lib/autoconf/general.m4:2053: AC_CACHE_CHECK is expanded from...
build/configure.ac.warnings:39: the top level
build/configure.ac.warnings:39: warning: AC_LANG_CONFTEST: no AC_LANG_SOURCE call detected in body
../../lib/autoconf/lang.m4:194: AC_LANG_CONFTEST is expanded from...
../../lib/autoconf/general.m4:2662: _AC_LINK_IFELSE is expanded from...
../../lib/autoconf/general.m4:2679: AC_LINK_IFELSE is expanded from...
build/aclocal.cairo.m4:89: CAIRO_CC_TRY_LINK_WITH_ENV_SILENT is expanded from...
build/aclocal.cairo.m4:124: CAIRO_CC_TRY_FLAG_SILENT is expanded from...
build/aclocal.cairo.m4:148: CAIRO_CC_TRY_FLAG is expanded from...
../../lib/m4sugar/m4sh.m4:606: AS_IF is expanded from...
../../lib/autoconf/general.m4:2032: AC_CACHE_VAL is expanded from...
../../lib/autoconf/general.m4:2053: AC_CACHE_CHECK is expanded from...
build/configure.ac.warnings:39: the top level
build/configure.ac.warnings:69: warning: AC_LANG_CONFTEST: no AC_LANG_SOURCE call detected in body
../../lib/autoconf/lang.m4:194: AC_LANG_CONFTEST is expanded from...
../../lib/autoconf/general.m4:2662: _AC_LINK_IFELSE is expanded from...
../../lib/autoconf/general.m4:2679: AC_LINK_IFELSE is expanded from...
build/aclocal.cairo.m4:89: CAIRO_CC_TRY_LINK_WITH_ENV_SILENT is expanded from...
build/aclocal.cairo.m4:124: CAIRO_CC_TRY_FLAG_SILENT is expanded from...
../../lib/m4sugar/m4sh.m4:606: AS_IF is expanded from...
../../lib/autoconf/general.m4:2032: AC_CACHE_VAL is expanded from...
../../lib/autoconf/general.m4:2053: AC_CACHE_CHECK is expanded from...
build/configure.ac.warnings:69: the top level
build/configure.ac.warnings:83: warning: AC_LANG_CONFTEST: no AC_LANG_SOURCE call detected in body
../../lib/autoconf/lang.m4:194: AC_LANG_CONFTEST is expanded from...
../../lib/autoconf/general.m4:2662: _AC_LINK_IFELSE is expanded from...
../../lib/autoconf/general.m4:2679: AC_LINK_IFELSE is expanded from...
build/aclocal.cairo.m4:89: CAIRO_CC_TRY_LINK_WITH_ENV_SILENT is expanded from...
build/aclocal.cairo.m4:124: CAIRO_CC_TRY_FLAG_SILENT is expanded from...
build/aclocal.cairo.m4:131: CAIRO_CC_CHECK_WERROR is expanded from...
build/aclocal.cairo.m4:148: CAIRO_CC_TRY_FLAG is expanded from...
../../lib/m4sugar/m4sh.m4:606: AS_IF is expanded from...
../../lib/autoconf/general.m4:2032: AC_CACHE_VAL is expanded from...
../../lib/autoconf/general.m4:2053: AC_CACHE_CHECK is expanded from...
build/configure.ac.warnings:83: the top level
build/configure.ac.warnings:83: warning: AC_LANG_CONFTEST: no AC_LANG_SOURCE call detected in body
../../lib/autoconf/lang.m4:194: AC_LANG_CONFTEST is expanded from...
../../lib/autoconf/general.m4:2662: _AC_LINK_IFELSE is expanded from...
../../lib/autoconf/general.m4:2679: AC_LINK_IFELSE is expanded from...
build/aclocal.cairo.m4:89: CAIRO_CC_TRY_LINK_WITH_ENV_SILENT is expanded from...
build/aclocal.cairo.m4:124: CAIRO_CC_TRY_FLAG_SILENT is expanded from...
build/aclocal.cairo.m4:148: CAIRO_CC_TRY_FLAG is expanded from...
../../lib/m4sugar/m4sh.m4:606: AS_IF is expanded from...
../../lib/autoconf/general.m4:2032: AC_CACHE_VAL is expanded from...
../../lib/autoconf/general.m4:2053: AC_CACHE_CHECK is expanded from...
build/configure.ac.warnings:83: the top level
build/configure.ac.analysis:75: warning: AC_LANG_CONFTEST: no AC_LANG_SOURCE call detected in body
../../lib/autoconf/lang.m4:194: AC_LANG_CONFTEST is expanded from...
../../lib/autoconf/general.m4:2662: _AC_LINK_IFELSE is expanded from...
../../lib/autoconf/general.m4:2679: AC_LINK_IFELSE is expanded from...
build/aclocal.cairo.m4:89: CAIRO_CC_TRY_LINK_WITH_ENV_SILENT is expanded from...
build/aclocal.cairo.m4:124: CAIRO_CC_TRY_FLAG_SILENT is expanded from...
build/aclocal.cairo.m4:131: CAIRO_CC_CHECK_WERROR is expanded from...
build/aclocal.cairo.m4:148: CAIRO_CC_TRY_FLAG is expanded from...
build/configure.ac.analysis:75: the top level
build/configure.ac.analysis:75: warning: AC_LANG_CONFTEST: no AC_LANG_SOURCE call detected in body
../../lib/autoconf/lang.m4:194: AC_LANG_CONFTEST is expanded from...
../../lib/autoconf/general.m4:2662: _AC_LINK_IFELSE is expanded from...
../../lib/autoconf/general.m4:2679: AC_LINK_IFELSE is expanded from...
build/aclocal.cairo.m4:89: CAIRO_CC_TRY_LINK_WITH_ENV_SILENT is expanded from...
build/aclocal.cairo.m4:124: CAIRO_CC_TRY_FLAG_SILENT is expanded from...
build/aclocal.cairo.m4:148: CAIRO_CC_TRY_FLAG is expanded from...
build/configure.ac.analysis:75: the top level
configure.ac:646: warning: AC_LANG_CONFTEST: no AC_LANG_SOURCE call detected in body
../../lib/autoconf/lang.m4:194: AC_LANG_CONFTEST is expanded from...
../../lib/autoconf/general.m4:2662: _AC_LINK_IFELSE is expanded from...
../../lib/autoconf/general.m4:2679: AC_LINK_IFELSE is expanded from...
build/aclocal.cairo.m4:89: CAIRO_CC_TRY_LINK_WITH_ENV_SILENT is expanded from...
build/configure.ac.pthread:136: CAIRO_CHECK_PTHREAD is expanded from...
build/configure.ac.pthread:189: CAIRO_CONFIGURE_PTHREAD is expanded from...
../../lib/m4sugar/m4sh.m4:606: AS_IF is expanded from...
../../lib/autoconf/general.m4:2032: AC_CACHE_VAL is expanded from...
../../lib/autoconf/general.m4:2053: AC_CACHE_CHECK is expanded from...
../../lib/m4sugar/m4sh.m4:517: AS_CASE is expanded from...
build/aclocal.enable.m4:41: _CAIRO_ENABLE is expanded from...
build/configure.ac.features:23: CAIRO_ENABLE is expanded from...
configure.ac:646: the top level
build/configure.ac.warnings:39: warning: AC_LANG_CONFTEST: no AC_LANG_SOURCE call detected in body
../../lib/autoconf/lang.m4:194: AC_LANG_CONFTEST is expanded from...
../../lib/autoconf/general.m4:2662: _AC_LINK_IFELSE is expanded from...
../../lib/autoconf/general.m4:2679: AC_LINK_IFELSE is expanded from...
build/aclocal.cairo.m4:89: CAIRO_CC_TRY_LINK_WITH_ENV_SILENT is expanded from...
build/aclocal.cairo.m4:124: CAIRO_CC_TRY_FLAG_SILENT is expanded from...
build/aclocal.cairo.m4:131: CAIRO_CC_CHECK_WERROR is expanded from...
build/aclocal.cairo.m4:148: CAIRO_CC_TRY_FLAG is expanded from...
../../lib/m4sugar/m4sh.m4:606: AS_IF is expanded from...
../../lib/autoconf/general.m4:2032: AC_CACHE_VAL is expanded from...
../../lib/autoconf/general.m4:2053: AC_CACHE_CHECK is expanded from...
build/configure.ac.warnings:39: the top level
build/configure.ac.warnings:39: warning: AC_LANG_CONFTEST: no AC_LANG_SOURCE call detected in body
../../lib/autoconf/lang.m4:194: AC_LANG_CONFTEST is expanded from...
../../lib/autoconf/general.m4:2662: _AC_LINK_IFELSE is expanded from...
../../lib/autoconf/general.m4:2679: AC_LINK_IFELSE is expanded from...
build/aclocal.cairo.m4:89: CAIRO_CC_TRY_LINK_WITH_ENV_SILENT is expanded from...
build/aclocal.cairo.m4:124: CAIRO_CC_TRY_FLAG_SILENT is expanded from...
build/aclocal.cairo.m4:148: CAIRO_CC_TRY_FLAG is expanded from...
../../lib/m4sugar/m4sh.m4:606: AS_IF is expanded from...
../../lib/autoconf/general.m4:2032: AC_CACHE_VAL is expanded from...
../../lib/autoconf/general.m4:2053: AC_CACHE_CHECK is expanded from...
build/configure.ac.warnings:39: the top level
build/configure.ac.warnings:69: warning: AC_LANG_CONFTEST: no AC_LANG_SOURCE call detected in body
../../lib/autoconf/lang.m4:194: AC_LANG_CONFTEST is expanded from...
../../lib/autoconf/general.m4:2662: _AC_LINK_IFELSE is expanded from...
../../lib/autoconf/general.m4:2679: AC_LINK_IFELSE is expanded from...
build/aclocal.cairo.m4:89: CAIRO_CC_TRY_LINK_WITH_ENV_SILENT is expanded from...
build/aclocal.cairo.m4:124: CAIRO_CC_TRY_FLAG_SILENT is expanded from...
../../lib/m4sugar/m4sh.m4:606: AS_IF is expanded from...
../../lib/autoconf/general.m4:2032: AC_CACHE_VAL is expanded from...
../../lib/autoconf/general.m4:2053: AC_CACHE_CHECK is expanded from...
build/configure.ac.warnings:69: the top level
build/configure.ac.warnings:83: warning: AC_LANG_CONFTEST: no AC_LANG_SOURCE call detected in body
../../lib/autoconf/lang.m4:194: AC_LANG_CONFTEST is expanded from...
../../lib/autoconf/general.m4:2662: _AC_LINK_IFELSE is expanded from...
../../lib/autoconf/general.m4:2679: AC_LINK_IFELSE is expanded from...
build/aclocal.cairo.m4:89: CAIRO_CC_TRY_LINK_WITH_ENV_SILENT is expanded from...
build/aclocal.cairo.m4:124: CAIRO_CC_TRY_FLAG_SILENT is expanded from...
build/aclocal.cairo.m4:131: CAIRO_CC_CHECK_WERROR is expanded from...
build/aclocal.cairo.m4:148: CAIRO_CC_TRY_FLAG is expanded from...
../../lib/m4sugar/m4sh.m4:606: AS_IF is expanded from...
../../lib/autoconf/general.m4:2032: AC_CACHE_VAL is expanded from...
../../lib/autoconf/general.m4:2053: AC_CACHE_CHECK is expanded from...
build/configure.ac.warnings:83: the top level
build/configure.ac.warnings:83: warning: AC_LANG_CONFTEST: no AC_LANG_SOURCE call detected in body
../../lib/autoconf/lang.m4:194: AC_LANG_CONFTEST is expanded from...
../../lib/autoconf/general.m4:2662: _AC_LINK_IFELSE is expanded from...
../../lib/autoconf/general.m4:2679: AC_LINK_IFELSE is expanded from...
build/aclocal.cairo.m4:89: CAIRO_CC_TRY_LINK_WITH_ENV_SILENT is expanded from...
build/aclocal.cairo.m4:124: CAIRO_CC_TRY_FLAG_SILENT is expanded from...
build/aclocal.cairo.m4:148: CAIRO_CC_TRY_FLAG is expanded from...
../../lib/m4sugar/m4sh.m4:606: AS_IF is expanded from...
../../lib/autoconf/general.m4:2032: AC_CACHE_VAL is expanded from...
../../lib/autoconf/general.m4:2053: AC_CACHE_CHECK is expanded from...
build/configure.ac.warnings:83: the top level
build/configure.ac.analysis:75: warning: AC_LANG_CONFTEST: no AC_LANG_SOURCE call detected in body
../../lib/autoconf/lang.m4:194: AC_LANG_CONFTEST is expanded from...
../../lib/autoconf/general.m4:2662: _AC_LINK_IFELSE is expanded from...
../../lib/autoconf/general.m4:2679: AC_LINK_IFELSE is expanded from...
build/aclocal.cairo.m4:89: CAIRO_CC_TRY_LINK_WITH_ENV_SILENT is expanded from...
build/aclocal.cairo.m4:124: CAIRO_CC_TRY_FLAG_SILENT is expanded from...
build/aclocal.cairo.m4:131: CAIRO_CC_CHECK_WERROR is expanded from...
build/aclocal.cairo.m4:148: CAIRO_CC_TRY_FLAG is expanded from...
build/configure.ac.analysis:75: the top level
build/configure.ac.analysis:75: warning: AC_LANG_CONFTEST: no AC_LANG_SOURCE call detected in body
../../lib/autoconf/lang.m4:194: AC_LANG_CONFTEST is expanded from...
../../lib/autoconf/general.m4:2662: _AC_LINK_IFELSE is expanded from...
../../lib/autoconf/general.m4:2679: AC_LINK_IFELSE is expanded from...
build/aclocal.cairo.m4:89: CAIRO_CC_TRY_LINK_WITH_ENV_SILENT is expanded from...
build/aclocal.cairo.m4:124: CAIRO_CC_TRY_FLAG_SILENT is expanded from...
build/aclocal.cairo.m4:148: CAIRO_CC_TRY_FLAG is expanded from...
build/configure.ac.analysis:75: the top level
configure.ac:646: warning: AC_LANG_CONFTEST: no AC_LANG_SOURCE call detected in body
../../lib/autoconf/lang.m4:194: AC_LANG_CONFTEST is expanded from...
../../lib/autoconf/general.m4:2662: _AC_LINK_IFELSE is expanded from...
../../lib/autoconf/general.m4:2679: AC_LINK_IFELSE is expanded from...
build/aclocal.cairo.m4:89: CAIRO_CC_TRY_LINK_WITH_ENV_SILENT is expanded from...
build/configure.ac.pthread:136: CAIRO_CHECK_PTHREAD is expanded from...
build/configure.ac.pthread:189: CAIRO_CONFIGURE_PTHREAD is expanded from...
../../lib/m4sugar/m4sh.m4:606: AS_IF is expanded from...
../../lib/autoconf/general.m4:2032: AC_CACHE_VAL is expanded from...
../../lib/autoconf/general.m4:2053: AC_CACHE_CHECK is expanded from...
../../lib/m4sugar/m4sh.m4:517: AS_CASE is expanded from...
build/aclocal.enable.m4:41: _CAIRO_ENABLE is expanded from...
build/configure.ac.features:23: CAIRO_ENABLE is expanded from...
configure.ac:646: the top level
build/configure.ac.warnings:39: warning: AC_LANG_CONFTEST: no AC_LANG_SOURCE call detected in body
../../lib/autoconf/lang.m4:194: AC_LANG_CONFTEST is expanded from...
../../lib/autoconf/general.m4:2662: _AC_LINK_IFELSE is expanded from...
../../lib/autoconf/general.m4:2679: AC_LINK_IFELSE is expanded from...
build/aclocal.cairo.m4:89: CAIRO_CC_TRY_LINK_WITH_ENV_SILENT is expanded from...
build/aclocal.cairo.m4:124: CAIRO_CC_TRY_FLAG_SILENT is expanded from...
build/aclocal.cairo.m4:131: CAIRO_CC_CHECK_WERROR is expanded from...
build/aclocal.cairo.m4:148: CAIRO_CC_TRY_FLAG is expanded from...
../../lib/m4sugar/m4sh.m4:606: AS_IF is expanded from...
../../lib/autoconf/general.m4:2032: AC_CACHE_VAL is expanded from...
../../lib/autoconf/general.m4:2053: AC_CACHE_CHECK is expanded from...
build/configure.ac.warnings:39: the top level
build/configure.ac.warnings:39: warning: AC_LANG_CONFTEST: no AC_LANG_SOURCE call detected in body
../../lib/autoconf/lang.m4:194: AC_LANG_CONFTEST is expanded from...
../../lib/autoconf/general.m4:2662: _AC_LINK_IFELSE is expanded from...
../../lib/autoconf/general.m4:2679: AC_LINK_IFELSE is expanded from...
build/aclocal.cairo.m4:89: CAIRO_CC_TRY_LINK_WITH_ENV_SILENT is expanded from...
build/aclocal.cairo.m4:124: CAIRO_CC_TRY_FLAG_SILENT is expanded from...
build/aclocal.cairo.m4:148: CAIRO_CC_TRY_FLAG is expanded from...
../../lib/m4sugar/m4sh.m4:606: AS_IF is expanded from...
../../lib/autoconf/general.m4:2032: AC_CACHE_VAL is expanded from...
../../lib/autoconf/general.m4:2053: AC_CACHE_CHECK is expanded from...
build/configure.ac.warnings:39: the top level
build/configure.ac.warnings:69: warning: AC_LANG_CONFTEST: no AC_LANG_SOURCE call detected in body
../../lib/autoconf/lang.m4:194: AC_LANG_CONFTEST is expanded from...
../../lib/autoconf/general.m4:2662: _AC_LINK_IFELSE is expanded from...
../../lib/autoconf/general.m4:2679: AC_LINK_IFELSE is expanded from...
build/aclocal.cairo.m4:89: CAIRO_CC_TRY_LINK_WITH_ENV_SILENT is expanded from...
build/aclocal.cairo.m4:124: CAIRO_CC_TRY_FLAG_SILENT is expanded from...
../../lib/m4sugar/m4sh.m4:606: AS_IF is expanded from...
../../lib/autoconf/general.m4:2032: AC_CACHE_VAL is expanded from...
../../lib/autoconf/general.m4:2053: AC_CACHE_CHECK is expanded from...
build/configure.ac.warnings:69: the top level
build/configure.ac.warnings:83: warning: AC_LANG_CONFTEST: no AC_LANG_SOURCE call detected in body
../../lib/autoconf/lang.m4:194: AC_LANG_CONFTEST is expanded from...
../../lib/autoconf/general.m4:2662: _AC_LINK_IFELSE is expanded from...
../../lib/autoconf/general.m4:2679: AC_LINK_IFELSE is expanded from...
build/aclocal.cairo.m4:89: CAIRO_CC_TRY_LINK_WITH_ENV_SILENT is expanded from...
build/aclocal.cairo.m4:124: CAIRO_CC_TRY_FLAG_SILENT is expanded from...
build/aclocal.cairo.m4:131: CAIRO_CC_CHECK_WERROR is expanded from...
build/aclocal.cairo.m4:148: CAIRO_CC_TRY_FLAG is expanded from...
../../lib/m4sugar/m4sh.m4:606: AS_IF is expanded from...
../../lib/autoconf/general.m4:2032: AC_CACHE_VAL is expanded from...
../../lib/autoconf/general.m4:2053: AC_CACHE_CHECK is expanded from...
build/configure.ac.warnings:83: the top level
build/configure.ac.warnings:83: warning: AC_LANG_CONFTEST: no AC_LANG_SOURCE call detected in body
../../lib/autoconf/lang.m4:194: AC_LANG_CONFTEST is expanded from...
../../lib/autoconf/general.m4:2662: _AC_LINK_IFELSE is expanded from...
../../lib/autoconf/general.m4:2679: AC_LINK_IFELSE is expanded from...
build/aclocal.cairo.m4:89: CAIRO_CC_TRY_LINK_WITH_ENV_SILENT is expanded from...
build/aclocal.cairo.m4:124: CAIRO_CC_TRY_FLAG_SILENT is expanded from...
build/aclocal.cairo.m4:148: CAIRO_CC_TRY_FLAG is expanded from...
../../lib/m4sugar/m4sh.m4:606: AS_IF is expanded from...
../../lib/autoconf/general.m4:2032: AC_CACHE_VAL is expanded from...
../../lib/autoconf/general.m4:2053: AC_CACHE_CHECK is expanded from...
build/configure.ac.warnings:83: the top level
build/configure.ac.analysis:75: warning: AC_LANG_CONFTEST: no AC_LANG_SOURCE call detected in body
../../lib/autoconf/lang.m4:194: AC_LANG_CONFTEST is expanded from...
../../lib/autoconf/general.m4:2662: _AC_LINK_IFELSE is expanded from...
../../lib/autoconf/general.m4:2679: AC_LINK_IFELSE is expanded from...
build/aclocal.cairo.m4:89: CAIRO_CC_TRY_LINK_WITH_ENV_SILENT is expanded from...
build/aclocal.cairo.m4:124: CAIRO_CC_TRY_FLAG_SILENT is expanded from...
build/aclocal.cairo.m4:131: CAIRO_CC_CHECK_WERROR is expanded from...
build/aclocal.cairo.m4:148: CAIRO_CC_TRY_FLAG is expanded from...
build/configure.ac.analysis:75: the top level
build/configure.ac.analysis:75: warning: AC_LANG_CONFTEST: no AC_LANG_SOURCE call detected in body
../../lib/autoconf/lang.m4:194: AC_LANG_CONFTEST is expanded from...
../../lib/autoconf/general.m4:2662: _AC_LINK_IFELSE is expanded from...
../../lib/autoconf/general.m4:2679: AC_LINK_IFELSE is expanded from...
build/aclocal.cairo.m4:89: CAIRO_CC_TRY_LINK_WITH_ENV_SILENT is expanded from...
build/aclocal.cairo.m4:124: CAIRO_CC_TRY_FLAG_SILENT is expanded from...
build/aclocal.cairo.m4:148: CAIRO_CC_TRY_FLAG is expanded from...
build/configure.ac.analysis:75: the top level
configure.ac:646: warning: AC_LANG_CONFTEST: no AC_LANG_SOURCE call detected in body
../../lib/autoconf/lang.m4:194: AC_LANG_CONFTEST is expanded from...
../../lib/autoconf/general.m4:2662: _AC_LINK_IFELSE is expanded from...
../../lib/autoconf/general.m4:2679: AC_LINK_IFELSE is expanded from...
build/aclocal.cairo.m4:89: CAIRO_CC_TRY_LINK_WITH_ENV_SILENT is expanded from...
build/configure.ac.pthread:136: CAIRO_CHECK_PTHREAD is expanded from...
build/configure.ac.pthread:189: CAIRO_CONFIGURE_PTHREAD is expanded from...
../../lib/m4sugar/m4sh.m4:606: AS_IF is expanded from...
../../lib/autoconf/general.m4:2032: AC_CACHE_VAL is expanded from...
../../lib/autoconf/general.m4:2053: AC_CACHE_CHECK is expanded from...
../../lib/m4sugar/m4sh.m4:517: AS_CASE is expanded from...
build/aclocal.enable.m4:41: _CAIRO_ENABLE is expanded from...
build/configure.ac.features:23: CAIRO_ENABLE is expanded from...
configure.ac:646: the top level
build/configure.ac.warnings:39: warning: AC_LANG_CONFTEST: no AC_LANG_SOURCE call detected in body
../../lib/autoconf/lang.m4:194: AC_LANG_CONFTEST is expanded from...
../../lib/autoconf/general.m4:2662: _AC_LINK_IFELSE is expanded from...
../../lib/autoconf/general.m4:2679: AC_LINK_IFELSE is expanded from...
build/aclocal.cairo.m4:89: CAIRO_CC_TRY_LINK_WITH_ENV_SILENT is expanded from...
build/aclocal.cairo.m4:124: CAIRO_CC_TRY_FLAG_SILENT is expanded from...
build/aclocal.cairo.m4:131: CAIRO_CC_CHECK_WERROR is expanded from...
build/aclocal.cairo.m4:148: CAIRO_CC_TRY_FLAG is expanded from...
../../lib/m4sugar/m4sh.m4:606: AS_IF is expanded from...
../../lib/autoconf/general.m4:2032: AC_CACHE_VAL is expanded from...
../../lib/autoconf/general.m4:2053: AC_CACHE_CHECK is expanded from...
build/configure.ac.warnings:39: the top level
build/configure.ac.warnings:39: warning: AC_LANG_CONFTEST: no AC_LANG_SOURCE call detected in body
../../lib/autoconf/lang.m4:194: AC_LANG_CONFTEST is expanded from...
../../lib/autoconf/general.m4:2662: _AC_LINK_IFELSE is expanded from...
../../lib/autoconf/general.m4:2679: AC_LINK_IFELSE is expanded from...
build/aclocal.cairo.m4:89: CAIRO_CC_TRY_LINK_WITH_ENV_SILENT is expanded from...
build/aclocal.cairo.m4:124: CAIRO_CC_TRY_FLAG_SILENT is expanded from...
build/aclocal.cairo.m4:148: CAIRO_CC_TRY_FLAG is expanded from...
../../lib/m4sugar/m4sh.m4:606: AS_IF is expanded from...
../../lib/autoconf/general.m4:2032: AC_CACHE_VAL is expanded from...
../../lib/autoconf/general.m4:2053: AC_CACHE_CHECK is expanded from...
build/configure.ac.warnings:39: the top level
build/configure.ac.warnings:69: warning: AC_LANG_CONFTEST: no AC_LANG_SOURCE call detected in body
../../lib/autoconf/lang.m4:194: AC_LANG_CONFTEST is expanded from...
../../lib/autoconf/general.m4:2662: _AC_LINK_IFELSE is expanded from...
../../lib/autoconf/general.m4:2679: AC_LINK_IFELSE is expanded from...
build/aclocal.cairo.m4:89: CAIRO_CC_TRY_LINK_WITH_ENV_SILENT is expanded from...
build/aclocal.cairo.m4:124: CAIRO_CC_TRY_FLAG_SILENT is expanded from...
../../lib/m4sugar/m4sh.m4:606: AS_IF is expanded from...
../../lib/autoconf/general.m4:2032: AC_CACHE_VAL is expanded from...
../../lib/autoconf/general.m4:2053: AC_CACHE_CHECK is expanded from...
build/configure.ac.warnings:69: the top level
build/configure.ac.warnings:83: warning: AC_LANG_CONFTEST: no AC_LANG_SOURCE call detected in body
../../lib/autoconf/lang.m4:194: AC_LANG_CONFTEST is expanded from...
../../lib/autoconf/general.m4:2662: _AC_LINK_IFELSE is expanded from...
../../lib/autoconf/general.m4:2679: AC_LINK_IFELSE is expanded from...
build/aclocal.cairo.m4:89: CAIRO_CC_TRY_LINK_WITH_ENV_SILENT is expanded from...
build/aclocal.cairo.m4:124: CAIRO_CC_TRY_FLAG_SILENT is expanded from...
build/aclocal.cairo.m4:131: CAIRO_CC_CHECK_WERROR is expanded from...
build/aclocal.cairo.m4:148: CAIRO_CC_TRY_FLAG is expanded from...
../../lib/m4sugar/m4sh.m4:606: AS_IF is expanded from...
../../lib/autoconf/general.m4:2032: AC_CACHE_VAL is expanded from...
../../lib/autoconf/general.m4:2053: AC_CACHE_CHECK is expanded from...
build/configure.ac.warnings:83: the top level
build/configure.ac.warnings:83: warning: AC_LANG_CONFTEST: no AC_LANG_SOURCE call detected in body
../../lib/autoconf/lang.m4:194: AC_LANG_CONFTEST is expanded from...
../../lib/autoconf/general.m4:2662: _AC_LINK_IFELSE is expanded from...
../../lib/autoconf/general.m4:2679: AC_LINK_IFELSE is expanded from...
build/aclocal.cairo.m4:89: CAIRO_CC_TRY_LINK_WITH_ENV_SILENT is expanded from...
build/aclocal.cairo.m4:124: CAIRO_CC_TRY_FLAG_SILENT is expanded from...
build/aclocal.cairo.m4:148: CAIRO_CC_TRY_FLAG is expanded from...
../../lib/m4sugar/m4sh.m4:606: AS_IF is expanded from...
../../lib/autoconf/general.m4:2032: AC_CACHE_VAL is expanded from...
../../lib/autoconf/general.m4:2053: AC_CACHE_CHECK is expanded from...
build/configure.ac.warnings:83: the top level
build/configure.ac.analysis:75: warning: AC_LANG_CONFTEST: no AC_LANG_SOURCE call detected in body
../../lib/autoconf/lang.m4:194: AC_LANG_CONFTEST is expanded from...
../../lib/autoconf/general.m4:2662: _AC_LINK_IFELSE is expanded from...
../../lib/autoconf/general.m4:2679: AC_LINK_IFELSE is expanded from...
build/aclocal.cairo.m4:89: CAIRO_CC_TRY_LINK_WITH_ENV_SILENT is expanded from...
build/aclocal.cairo.m4:124: CAIRO_CC_TRY_FLAG_SILENT is expanded from...
build/aclocal.cairo.m4:131: CAIRO_CC_CHECK_WERROR is expanded from...
build/aclocal.cairo.m4:148: CAIRO_CC_TRY_FLAG is expanded from...
build/configure.ac.analysis:75: the top level
build/configure.ac.analysis:75: warning: AC_LANG_CONFTEST: no AC_LANG_SOURCE call detected in body
../../lib/autoconf/lang.m4:194: AC_LANG_CONFTEST is expanded from...
../../lib/autoconf/general.m4:2662: _AC_LINK_IFELSE is expanded from...
../../lib/autoconf/general.m4:2679: AC_LINK_IFELSE is expanded from...
build/aclocal.cairo.m4:89: CAIRO_CC_TRY_LINK_WITH_ENV_SILENT is expanded from...
build/aclocal.cairo.m4:124: CAIRO_CC_TRY_FLAG_SILENT is expanded from...
build/aclocal.cairo.m4:148: CAIRO_CC_TRY_FLAG is expanded from...
build/configure.ac.analysis:75: the top level
configure.ac:646: warning: AC_LANG_CONFTEST: no AC_LANG_SOURCE call detected in body
../../lib/autoconf/lang.m4:194: AC_LANG_CONFTEST is expanded from...
../../lib/autoconf/general.m4:2662: _AC_LINK_IFELSE is expanded from...
../../lib/autoconf/general.m4:2679: AC_LINK_IFELSE is expanded from...
build/aclocal.cairo.m4:89: CAIRO_CC_TRY_LINK_WITH_ENV_SILENT is expanded from...
build/configure.ac.pthread:136: CAIRO_CHECK_PTHREAD is expanded from...
build/configure.ac.pthread:189: CAIRO_CONFIGURE_PTHREAD is expanded from...
../../lib/m4sugar/m4sh.m4:606: AS_IF is expanded from...
../../lib/autoconf/general.m4:2032: AC_CACHE_VAL is expanded from...
../../lib/autoconf/general.m4:2053: AC_CACHE_CHECK is expanded from...
../../lib/m4sugar/m4sh.m4:517: AS_CASE is expanded from...
build/aclocal.enable.m4:41: _CAIRO_ENABLE is expanded from...
build/configure.ac.features:23: CAIRO_ENABLE is expanded from...
configure.ac:646: the top level
test/Makefile.am:1735: `%'-style pattern rules are a GNU make extension
test/Makefile.am:1736: <: non-POSIX variable name
build/Makefile.am.changelog:57: `%'-style pattern rules are a GNU make extension
Makefile.am:80:   `build/Makefile.am.changelog' included from here
patch -Np1 < debian/ltmain_as-needed.patch
patching file build/ltmain.sh
Hunk #1 succeeded at 5800 (offset 1084 lines).
Hunk #2 FAILED at 5075.
1 out of 2 hunks FAILED -- saving rejects to file build/ltmain.sh.rej
make: *** [configure-common-stamp] Ошибка 1
dpkg-buildpackage: ошибка: debian/rules build возвратил код ошибки 2

57

гм... вот это номер да, как видно дебиановский патч дает ошибку. А cairo установленный и сорцы из сида или из testing? Как вариант предлагаю откатить до тестинг cairo и собирать соответственно из него. Хотя сид обычно работает очень хорошо и скорее всего проблемы в другом.

Если у вас не получается разговаривать снисходительным тоном, найдите пользователя Unix, он покажет, как это делается. Скотт Адамс

58

ABulychev,  ltmain_as-needed.patch  Это же не тот патч, что рекомендовал papin-aziat ?

patch -Np1 < debian/ltmain_as-needed.patch
patching file build/ltmain.sh
Hunk #1 succeeded at 5800 (offset 1084 lines).
Hunk #2 FAILED at 5075.

Тут ошибку же показывает?

59

Otten, это дебиановский патч :-)

Если у вас не получается разговаривать снисходительным тоном, найдите пользователя Unix, он покажет, как это делается. Скотт Адамс

60

papin-aziat пишет:

гм... вот это номер да, как видно дебиановский патч дает ошибку. А cairo установленный и сорцы из сида или из testing? Как вариант предлагаю откатить до тестинг cairo и собирать соответственно из него. Хотя сид обычно работает очень хорошо и скорее всего проблемы в другом.

В wheezy и sid одни и те же версии, так что разницы наверное не будет видно.
papin-aziat, забейте. Для моего случая нашел следующий выход: установка пакетов с патчами от infinality. wink